[Gsoc] Scilab Compilation error

classic Classic list List threaded Threaded
4 messages Options
Diganta Dutta Diganta Dutta
Reply | Threaded
Open this post in threaded view
|

[Gsoc] Scilab Compilation error

Hi,

configure: error: Could not find or use the Java package/jar jgraphx used by
Diagram design (looking for package com.mxgraph.view.mxGraph)

How to avoid this error? I installed the jgraph package but it still isn't
working.

Thank You



--
Sent from: http://mailinglists.scilab.org/Scilab-GSOC-Mailing-Lists-Archives-f2646148.html
_______________________________________________
gsoc mailing list
[hidden email]
http://lists.scilab.org/mailman/listinfo/gsoc
Clément David-3 Clément David-3
Reply | Threaded
Open this post in threaded view
|

Re: Scilab Compilation error

Hi Diganta,

Please post your config.log file and tell us more about your current jgraphx version and your
current system.

Thanks,

--
Clément

Le mercredi 07 mars 2018 à 13:24 -0700, Diganta Dutta a écrit :

> Hi,
>
> configure: error: Could not find or use the Java package/jar jgraphx used by
> Diagram design (looking for package com.mxgraph.view.mxGraph)
>
> How to avoid this error? I installed the jgraph package but it still isn't
> working.
>
> Thank You
>
>
>
> --
> Sent from: http://mailinglists.scilab.org/Scilab-GSOC-Mailing-Lists-Archives-f2646148.html
> _______________________________________________
> gsoc mailing list
> [hidden email]
> http://lists.scilab.org/mailman/listinfo/gsoc
_______________________________________________
gsoc mailing list
[hidden email]
http://lists.scilab.org/mailman/listinfo/gsoc
Diganta Dutta Diganta Dutta
Reply | Threaded
Open this post in threaded view
|

Re: Scilab Compilation error

Hi,

config.log file:

This file contains any messages produced by compilers while
running configure, to aid debugging if configure makes a mistake.

It was created by Scilab configure 6, which was
generated by GNU Autoconf 2.69.  Invocation command line was

  $ ./configure --without-modelica

## --------- ##
## Platform. ##
## --------- ##

hostname = TheDarkSide
uname -m = x86_64
uname -r = 4.13.0-36-generic
uname -s = Linux
uname -v = #40~16.04.1-Ubuntu SMP Fri Feb 16 23:25:58 UTC 2018

/usr/bin/uname -p = unknown
/bin/uname -X     = unknown

/bin/arch              = unknown
/usr/bin/arch -k       = unknown
/usr/convex/getsysinfo = unknown
/usr/bin/hostinfo      = unknown
/bin/machine           = unknown
/usr/bin/oslevel       = unknown
/bin/universe          = unknown

PATH: /u01/app/oracle/product/11.2.0/xe/bin
PATH: /home/codebuster/bin
PATH: /home/codebuster/.local/bin
PATH: /usr/local/sbin
PATH: /usr/local/bin
PATH: /usr/sbin
PATH: /usr/bin
PATH: /sbin
PATH: /bin
PATH: /usr/games
PATH: /usr/local/games
PATH: /snap/bin
PATH: /usr/lib/jvm/java-8-oracle/bin
PATH: /usr/lib/jvm/java-8-oracle/db/bin
PATH: /usr/lib/jvm/java-8-oracle/jre/bin


## ----------- ##
## Core tests. ##
## ----------- ##

configure:3355: checking whether ln -s works
configure:3359: result: yes
configure:3417: checking for gcc
configure:3433: found /usr/bin/gcc
configure:3444: result: gcc
configure:3673: checking for C compiler version
configure:3682: gcc --version >&5
gcc (Ubuntu 5.4.0-6ubuntu1~16.04.9) 5.4.0 20160609
Copyright (C) 2015 Free Software Foundation, Inc.
This is free software; see the source for copying conditions.  There is NO
warranty; not even for MERCHANTABILITY or FITNESS FOR A PARTICULAR PURPOSE.

configure:3693: $? = 0
configure:3682: gcc -v >&5
Using built-in specs.
COLLECT_GCC=gcc
COLLECT_LTO_WRAPPER=/usr/lib/gcc/x86_64-linux-gnu/5/lto-wrapper
Target: x86_64-linux-gnu
Configured with: ../src/configure -v --with-pkgversion='Ubuntu
5.4.0-6ubuntu1~16.04.9'
--with-bugurl=file:///usr/share/doc/gcc-5/README.Bugs
--enable-languages=c,ada,c++,java,go,d,fortran,objc,obj-c++ --prefix=/usr
--program-suffix=-5 --enable-shared --enable-linker-build-id
--libexecdir=/usr/lib --without-included-gettext --enable-threads=posix
--libdir=/usr/lib --enable-nls --with-sysroot=/ --enable-clocale=gnu
--enable-libstdcxx-debug --enable-libstdcxx-time=yes
--with-default-libstdcxx-abi=new --enable-gnu-unique-object
--disable-vtable-verify --enable-libmpx --enable-plugin --with-system-zlib
--disable-browser-plugin --enable-java-awt=gtk --enable-gtk-cairo
--with-java-home=/usr/lib/jvm/java-1.5.0-gcj-5-amd64/jre --enable-java-home
--with-jvm-root-dir=/usr/lib/jvm/java-1.5.0-gcj-5-amd64
--with-jvm-jar-dir=/usr/lib/jvm-exports/java-1.5.0-gcj-5-amd64
--with-arch-directory=amd64 --with-ecj-jar=/usr/share/java/eclipse-ecj.jar
--enable-objc-gc --enable-multiarch --disable-werror --with-arch-32=i686
--with-abi=m64 --with-multilib-list=m32,m64,mx32 --enable-multilib
--with-tune=generic --enable-checking=release --build=x86_64-linux-gnu
--host=x86_64-linux-gnu --target=x86_64-linux-gnu
Thread model: posix
gcc version 5.4.0 20160609 (Ubuntu 5.4.0-6ubuntu1~16.04.9)
configure:3693: $? = 0
configure:3682: gcc -V >&5
gcc: error: unrecognized command line option '-V'
gcc: fatal error: no input files
compilation terminated.
configure:3693: $? = 1
configure:3682: gcc -qversion >&5
gcc: error: unrecognized command line option '-qversion'
gcc: fatal error: no input files
compilation terminated.
configure:3693: $? = 1
configure:3713: checking whether the C compiler works
configure:3735: gcc    conftest.c  >&5
configure:3739: $? = 0
configure:3787: result: yes
configure:3790: checking for C compiler default output file name
configure:3792: result: a.out
configure:3798: checking for suffix of executables
configure:3805: gcc -o conftest    conftest.c  >&5
configure:3809: $? = 0
configure:3831: result:
configure:3853: checking whether we are cross compiling
configure:3861: gcc -o conftest    conftest.c  >&5
configure:3865: $? = 0
configure:3872: ./conftest
configure:3876: $? = 0
configure:3891: result: no
configure:3896: checking for suffix of object files
configure:3918: gcc -c   conftest.c >&5
configure:3922: $? = 0
configure:3943: result: o
configure:3947: checking whether we are using the GNU C compiler
configure:3966: gcc -c   conftest.c >&5
configure:3966: $? = 0
configure:3975: result: yes
configure:3984: checking whether gcc accepts -g
configure:4004: gcc -c -g  conftest.c >&5
configure:4004: $? = 0
configure:4045: result: yes
configure:4062: checking for gcc option to accept ISO C89
configure:4125: gcc  -c -g -O2  conftest.c >&5
configure:4125: $? = 0
configure:4138: result: none needed
configure:4163: checking whether gcc understands -c and -o together
configure:4185: gcc -c conftest.c -o conftest2.o
configure:4188: $? = 0
configure:4185: gcc -c conftest.c -o conftest2.o
configure:4188: $? = 0
configure:4200: result: yes
configure:4267: checking for ar
configure:4283: found /usr/bin/ar
configure:4294: result: ar
configure:4320: checking the archiver (ar) interface
configure:4336: gcc -c -g -O2  conftest.c >&5
configure:4336: $? = 0
configure:4338: ar cru libconftest.a conftest.o >&5
ar: `u' modifier ignored since `D' is the default (see `U')
configure:4341: $? = 0
configure:4369: result: ar
configure:4398: checking for special C compiler options needed for large
files
configure:4443: result: no
configure:4449: checking for _FILE_OFFSET_BITS value needed for large files
configure:4474: gcc -c -g -O2  conftest.c >&5
configure:4474: $? = 0
configure:4506: result: no
configure:4591: checking for _LARGEFILE64_SOURCE value needed for large
files
configure:4614: gcc -c -g -O2  conftest.c >&5
conftest.c: In function 'main':
conftest.c:18:68: error: 'O_LARGEFILE' undeclared (first use in this
function)
                 int fd = open ("__o_largefile", O_CREAT | O_RDWR |
O_LARGEFILE, 0644);
                                                                    ^
conftest.c:18:68: note: each undeclared identifier is reported only once for
each function it appears in
configure:4614: $? = 1
configure: failed program was:
| /* confdefs.h */
| #define PACKAGE_NAME "Scilab"
| #define PACKAGE_TARNAME "scilab"
| #define PACKAGE_VERSION "6"
| #define PACKAGE_STRING "Scilab 6"
| #define PACKAGE_BUGREPORT "http://bugzilla.scilab.org/"
| #define PACKAGE_URL ""
| /* end confdefs.h.  */
|
|                 #include <sys/types.h>
|                 #include <sys/stat.h>
|                 #include <fcntl.h>
|
| int
| main ()
| {
|
|                 int fd = open ("__o_largefile", O_CREAT | O_RDWR |
O_LARGEFILE, 0644);
|
|   ;
|   return 0;
| }
configure:4638: gcc -c -g -O2  conftest.c >&5
configure:4638: $? = 0
configure:4653: result:
configure:4693: checking for a BSD-compatible install
configure:4761: result: /usr/bin/install -c
configure:4776: checking build system type
configure:4790: result: x86_64-unknown-linux-gnu
configure:4810: checking host system type
configure:4823: result: x86_64-unknown-linux-gnu
configure:4867: checking for ld used by GCC
configure:4931: result: /usr/bin/ld
configure:4938: checking if the linker (/usr/bin/ld) is GNU ld
configure:4951: result: yes
configure:4957: checking for shared library path variable
configure:4970: result: LD_LIBRARY_PATH
configure:4975: checking whether to activate relocatable installation
configure:4990: result: no
configure:5012: checking how to run the C preprocessor
configure:5043: gcc -E  conftest.c
configure:5043: $? = 0
configure:5057: gcc -E  conftest.c
conftest.c:10:28: fatal error: ac_nonexistent.h: No such file or directory
compilation terminated.
configure:5057: $? = 1
configure: failed program was:
| /* confdefs.h */
| #define PACKAGE_NAME "Scilab"
| #define PACKAGE_TARNAME "scilab"
| #define PACKAGE_VERSION "6"
| #define PACKAGE_STRING "Scilab 6"
| #define PACKAGE_BUGREPORT "http://bugzilla.scilab.org/"
| #define PACKAGE_URL ""
| #define INSTALLPREFIX "/usr/local"
| /* end confdefs.h.  */
| #include <ac_nonexistent.h>
configure:5082: result: gcc -E
configure:5102: gcc -E  conftest.c
configure:5102: $? = 0
configure:5116: gcc -E  conftest.c
conftest.c:10:28: fatal error: ac_nonexistent.h: No such file or directory
compilation terminated.
configure:5116: $? = 1
configure: failed program was:
| /* confdefs.h */
| #define PACKAGE_NAME "Scilab"
| #define PACKAGE_TARNAME "scilab"
| #define PACKAGE_VERSION "6"
| #define PACKAGE_STRING "Scilab 6"
| #define PACKAGE_BUGREPORT "http://bugzilla.scilab.org/"
| #define PACKAGE_URL ""
| #define INSTALLPREFIX "/usr/local"
| /* end confdefs.h.  */
| #include <ac_nonexistent.h>
configure:5145: checking for grep that handles long lines and -e
configure:5203: result: /bin/grep
configure:5208: checking for egrep
configure:5270: result: /bin/grep -E
configure:5275: checking for ANSI C header files
configure:5295: gcc -c -g -O2  conftest.c >&5
configure:5295: $? = 0
configure:5368: gcc -o conftest -g -O2   conftest.c  >&5
configure:5368: $? = 0
configure:5368: ./conftest
configure:5368: $? = 0
configure:5379: result: yes
configure:5392: checking for sys/types.h
configure:5392: gcc -c -g -O2  conftest.c >&5
configure:5392: $? = 0
configure:5392: result: yes
configure:5392: checking for sys/stat.h
configure:5392: gcc -c -g -O2  conftest.c >&5
configure:5392: $? = 0
configure:5392: result: yes
configure:5392: checking for stdlib.h
configure:5392: gcc -c -g -O2  conftest.c >&5
configure:5392: $? = 0
configure:5392: result: yes
configure:5392: checking for string.h
configure:5392: gcc -c -g -O2  conftest.c >&5
configure:5392: $? = 0
configure:5392: result: yes
configure:5392: checking for memory.h
configure:5392: gcc -c -g -O2  conftest.c >&5
configure:5392: $? = 0
configure:5392: result: yes
configure:5392: checking for strings.h
configure:5392: gcc -c -g -O2  conftest.c >&5
configure:5392: $? = 0
configure:5392: result: yes
configure:5392: checking for inttypes.h
configure:5392: gcc -c -g -O2  conftest.c >&5
configure:5392: $? = 0
configure:5392: result: yes
configure:5392: checking for stdint.h
configure:5392: gcc -c -g -O2  conftest.c >&5
configure:5392: $? = 0
configure:5392: result: yes
configure:5392: checking for unistd.h
configure:5392: gcc -c -g -O2  conftest.c >&5
configure:5392: $? = 0
configure:5392: result: yes
configure:5502: checking for shared library run path origin
configure:5515: result: done
configure:5539: checking whether to enable maintainer-specific portions of
Makefiles
configure:5548: result: no
configure:5564: checking whether build environment is sane
configure:5619: result: yes
configure:5767: checking for a thread-safe mkdir -p
configure:5806: result: /bin/mkdir -p
configure:5813: checking for gawk
configure:5843: result: no
configure:5813: checking for mawk
configure:5829: found /usr/bin/mawk
configure:5840: result: mawk
configure:5851: checking whether make sets $(MAKE)
configure:5873: result: yes
configure:5903: checking for style of include used by make
configure:5931: result: GNU
configure:5965: checking whether make supports nested variables
configure:5982: result: yes
configure:6067: checking dependency style of gcc
configure:6178: result: gcc3
configure:6369: checking how to run the C preprocessor
configure:6439: result: gcc -E
configure:6459: gcc -E  conftest.c
configure:6459: $? = 0
configure:6473: gcc -E  conftest.c
conftest.c:23:28: fatal error: ac_nonexistent.h: No such file or directory
compilation terminated.
configure:6473: $? = 1
configure: failed program was:
| /* confdefs.h */
| #define PACKAGE_NAME "Scilab"
| #define PACKAGE_TARNAME "scilab"
| #define PACKAGE_VERSION "6"
| #define PACKAGE_STRING "Scilab 6"
| #define PACKAGE_BUGREPORT "http://bugzilla.scilab.org/"
| #define PACKAGE_URL ""
| #define INSTALLPREFIX "/usr/local"
| #define STDC_HEADERS 1
| #define HAVE_SYS_TYPES_H 1
| #define HAVE_SYS_STAT_H 1
| #define HAVE_STDLIB_H 1
| #define HAVE_STRING_H 1
| #define HAVE_MEMORY_H 1
| #define HAVE_STRINGS_H 1
| #define HAVE_INTTYPES_H 1
| #define HAVE_STDINT_H 1
| #define HAVE_UNISTD_H 1
| #define INSTALLPREFIX "/usr/local"
| #define PACKAGE "scilab"
| #define VERSION "6"
| /* end confdefs.h.  */
| #include <ac_nonexistent.h>
configure:6501: checking for grep that handles long lines and -e
configure:6559: result: /bin/grep
configure:6715: checking for pkg-config
configure:6733: found /usr/bin/pkg-config
configure:6745: result: /usr/bin/pkg-config
configure:6770: checking pkg-config is at least version 0.9.0
configure:6773: result: yes
configure:7285: checking for gfortran
configure:7301: found /usr/bin/gfortran
configure:7312: result: gfortran
configure:7338: checking for Fortran 77 compiler version
configure:7347: gfortran --version >&5
GNU Fortran (Ubuntu 5.4.0-6ubuntu1~16.04.9) 5.4.0 20160609
Copyright (C) 2015 Free Software Foundation, Inc.

GNU Fortran comes with NO WARRANTY, to the extent permitted by law.
You may redistribute copies of GNU Fortran
under the terms of the GNU General Public License.
For more information about these matters, see the file named COPYING

configure:7358: $? = 0
configure:7347: gfortran -v >&5
Using built-in specs.
COLLECT_GCC=gfortran
COLLECT_LTO_WRAPPER=/usr/lib/gcc/x86_64-linux-gnu/5/lto-wrapper
Target: x86_64-linux-gnu
Configured with: ../src/configure -v --with-pkgversion='Ubuntu
5.4.0-6ubuntu1~16.04.9'
--with-bugurl=file:///usr/share/doc/gcc-5/README.Bugs
--enable-languages=c,ada,c++,java,go,d,fortran,objc,obj-c++ --prefix=/usr
--program-suffix=-5 --enable-shared --enable-linker-build-id
--libexecdir=/usr/lib --without-included-gettext --enable-threads=posix
--libdir=/usr/lib --enable-nls --with-sysroot=/ --enable-clocale=gnu
--enable-libstdcxx-debug --enable-libstdcxx-time=yes
--with-default-libstdcxx-abi=new --enable-gnu-unique-object
--disable-vtable-verify --enable-libmpx --enable-plugin --with-system-zlib
--disable-browser-plugin --enable-java-awt=gtk --enable-gtk-cairo
--with-java-home=/usr/lib/jvm/java-1.5.0-gcj-5-amd64/jre --enable-java-home
--with-jvm-root-dir=/usr/lib/jvm/java-1.5.0-gcj-5-amd64
--with-jvm-jar-dir=/usr/lib/jvm-exports/java-1.5.0-gcj-5-amd64
--with-arch-directory=amd64 --with-ecj-jar=/usr/share/java/eclipse-ecj.jar
--enable-objc-gc --enable-multiarch --disable-werror --with-arch-32=i686
--with-abi=m64 --with-multilib-list=m32,m64,mx32 --enable-multilib
--with-tune=generic --enable-checking=release --build=x86_64-linux-gnu
--host=x86_64-linux-gnu --target=x86_64-linux-gnu
Thread model: posix
gcc version 5.4.0 20160609 (Ubuntu 5.4.0-6ubuntu1~16.04.9)
configure:7358: $? = 0
configure:7347: gfortran -V >&5
gfortran: error: unrecognized command line option '-V'
gfortran: fatal error: no input files
compilation terminated.
configure:7358: $? = 1
configure:7347: gfortran -qversion >&5
gfortran: error: unrecognized command line option '-qversion'
gfortran: fatal error: no input files
compilation terminated.
configure:7358: $? = 1
configure:7367: checking whether we are using the GNU Fortran 77 compiler
configure:7380: gfortran -c  conftest.F >&5
configure:7380: $? = 0
configure:7389: result: yes
configure:7395: checking whether gfortran accepts -g
configure:7406: gfortran -c -g conftest.f >&5
configure:7406: $? = 0
configure:7414: result: yes
configure:7668: checking if gfortran is a fortran 90 compatible compiler
configure:7693: gfortran -c  conftest.f >&5
configure:7693: $? = 0
configure:7694: result: yes
configure:9154: checking size of int
configure:9159: gcc -o conftest -g -O2   conftest.c  >&5
configure:9159: $? = 0
configure:9159: ./conftest
configure:9159: $? = 0
configure:9173: result: 4
configure:9187: checking size of long
configure:9192: gcc -o conftest -g -O2   conftest.c  >&5
configure:9192: $? = 0
configure:9192: ./conftest
configure:9192: $? = 0
configure:9206: result: 8
configure:9277: checking for g++
configure:9293: found /usr/bin/g++
configure:9304: result: g++
configure:9331: checking for C++ compiler version
configure:9340: g++ --version >&5
g++ (Ubuntu 5.4.0-6ubuntu1~16.04.9) 5.4.0 20160609
Copyright (C) 2015 Free Software Foundation, Inc.
This is free software; see the source for copying conditions.  There is NO
warranty; not even for MERCHANTABILITY or FITNESS FOR A PARTICULAR PURPOSE.

configure:9351: $? = 0
configure:9340: g++ -v >&5
Using built-in specs.
COLLECT_GCC=g++
COLLECT_LTO_WRAPPER=/usr/lib/gcc/x86_64-linux-gnu/5/lto-wrapper
Target: x86_64-linux-gnu
Configured with: ../src/configure -v --with-pkgversion='Ubuntu
5.4.0-6ubuntu1~16.04.9'
--with-bugurl=file:///usr/share/doc/gcc-5/README.Bugs
--enable-languages=c,ada,c++,java,go,d,fortran,objc,obj-c++ --prefix=/usr
--program-suffix=-5 --enable-shared --enable-linker-build-id
--libexecdir=/usr/lib --without-included-gettext --enable-threads=posix
--libdir=/usr/lib --enable-nls --with-sysroot=/ --enable-clocale=gnu
--enable-libstdcxx-debug --enable-libstdcxx-time=yes
--with-default-libstdcxx-abi=new --enable-gnu-unique-object
--disable-vtable-verify --enable-libmpx --enable-plugin --with-system-zlib
--disable-browser-plugin --enable-java-awt=gtk --enable-gtk-cairo
--with-java-home=/usr/lib/jvm/java-1.5.0-gcj-5-amd64/jre --enable-java-home
--with-jvm-root-dir=/usr/lib/jvm/java-1.5.0-gcj-5-amd64
--with-jvm-jar-dir=/usr/lib/jvm-exports/java-1.5.0-gcj-5-amd64
--with-arch-directory=amd64 --with-ecj-jar=/usr/share/java/eclipse-ecj.jar
--enable-objc-gc --enable-multiarch --disable-werror --with-arch-32=i686
--with-abi=m64 --with-multilib-list=m32,m64,mx32 --enable-multilib
--with-tune=generic --enable-checking=release --build=x86_64-linux-gnu
--host=x86_64-linux-gnu --target=x86_64-linux-gnu
Thread model: posix
gcc version 5.4.0 20160609 (Ubuntu 5.4.0-6ubuntu1~16.04.9)
configure:9351: $? = 0
configure:9340: g++ -V >&5
g++: error: unrecognized command line option '-V'
g++: fatal error: no input files
compilation terminated.
configure:9351: $? = 1
configure:9340: g++ -qversion >&5
g++: error: unrecognized command line option '-qversion'
g++: fatal error: no input files
compilation terminated.
configure:9351: $? = 1
configure:9355: checking whether we are using the GNU C++ compiler
configure:9374: g++ -c   conftest.cpp >&5
configure:9374: $? = 0
configure:9383: result: yes
configure:9392: checking whether g++ accepts -g
configure:9412: g++ -c -g  conftest.cpp >&5
configure:9412: $? = 0
configure:9453: result: yes
configure:9478: checking dependency style of g++
configure:9589: result: gcc3
configure:9613: checking for g++
configure:9629: found /usr/bin/g++
configure:9641: result: yes
configure:9662: checking whether gfortran understands -c and -o together
configure:9680: gfortran  -c conftest.f -o conftest2.o >&5
configure:9684: $? = 0
configure:9691: gfortran  -c conftest.f -o conftest2.o >&5
configure:9695: $? = 0
configure:9703: result: yes
configure:10291: checking whether g++ supports C++11 features by default
configure:10325: g++ -c   conftest.cpp >&5
conftest.cpp:30:21: error: expected identifier before 'sizeof'
       static_assert(sizeof(int) <= sizeof(T), "not big enough");
                     ^
conftest.cpp:30:21: error: expected ',' or '...' before 'sizeof'
conftest.cpp:30:63: error: ISO C++ forbids declaration of 'static_assert'
with no type [-fpermissive]
       static_assert(sizeof(int) <= sizeof(T), "not big enough");
                                                               ^
conftest.cpp:37:20: warning: override controls (override/final) only
available with -std=c++11 or -std=gnu++11
     virtual void f() override {}
                    ^
conftest.cpp:40:29: error: '>>' should be '> >' within a nested template
argument list
     typedef check<check&lt;bool>> right_angle_brackets;
                             ^
conftest.cpp:43:13: error: expected constructor, destructor, or type
conversion before '(' token
     decltype(a) b;
             ^
conftest.cpp:47:15: error: expected unqualified-id before '&&' token
     check_type&& cr = static_cast<check_type&amp;&amp;>(c);
               ^
conftest.cpp:49:10: error: 'd' does not name a type
     auto d = a;
          ^
conftest.cpp:50:10: error: 'l' does not name a type
     auto l = [](){};
          ^
configure:10325: $? = 1
configure: failed program was:
| /* confdefs.h */
| #define PACKAGE_NAME "Scilab"
| #define PACKAGE_TARNAME "scilab"
| #define PACKAGE_VERSION "6"
| #define PACKAGE_STRING "Scilab 6"
| #define PACKAGE_BUGREPORT "http://bugzilla.scilab.org/"
| #define PACKAGE_URL ""
| #define INSTALLPREFIX "/usr/local"
| #define STDC_HEADERS 1
| #define HAVE_SYS_TYPES_H 1
| #define HAVE_SYS_STAT_H 1
| #define HAVE_STDLIB_H 1
| #define HAVE_STRING_H 1
| #define HAVE_MEMORY_H 1
| #define HAVE_STRINGS_H 1
| #define HAVE_INTTYPES_H 1
| #define HAVE_STDINT_H 1
| #define HAVE_UNISTD_H 1
| #define INSTALLPREFIX "/usr/local"
| #define PACKAGE "scilab"
| #define VERSION "6"
| #define G95_FORTRAN /**/
| #define SIZEOF_INT 4
| #define SIZEOF_LONG 8
| /* end confdefs.h.  */
|
|   template <typename T>
|     struct check
|     {
|       static_assert(sizeof(int) <= sizeof(T), "not big enough");
|     };
|
|     struct Base {
|     virtual void f() {}
|     };
|     struct Child : public Base {
|     virtual void f() override {}
|     };
|
|     typedef check<check&lt;bool>> right_angle_brackets;
|
|     int a;
|     decltype(a) b;
|
|     typedef check<int> check_type;
|     check_type c;
|     check_type&& cr = static_cast<check_type&amp;&amp;>(c);
|
|     auto d = a;
|     auto l = [](){};
|
configure:10332: result: no
configure:10343: checking whether g++ supports C++11 features with
-std=c++11
configure:10379: g++ -c  -std=c++11  conftest.cpp >&5
configure:10379: $? = 0
configure:10388: result: yes
configure:10449: checking for nm
configure:10465: found /usr/bin/nm
configure:10476: result: nm
configure:10491: checking for leading underscores with Fortran
(name-mangling scheme)
configure:10535: result: no
configure:10537: checking for trailing underscores with Fortran
(name-mangling scheme)
configure:10539: result: yes
configure:10546: checking use of the sharpsign in CPP
configure:10564: gcc -c -g -O2  conftest.c >&5
configure:10564: $? = 0
configure:10565: result: yes
configure:10586: result: Define C2F with Trailing Underscore and Sharp Sign
configure:10935: checking hdf5/serial/hdf5.h usability
configure:10935: gcc -c -g -O2  conftest.c >&5
configure:10935: $? = 0
configure:10935: result: yes
configure:10935: checking hdf5/serial/hdf5.h presence
configure:10935: gcc -E  conftest.c
configure:10935: $? = 0
configure:10935: result: yes
configure:10935: checking for hdf5/serial/hdf5.h
configure:10935: result: yes
configure:11017: checking for H5Fopen in -lhdf5_serial
configure:11043: gcc -o conftest -g -O2   -Wl,--no-as-needed conftest.c
-lhdf5_serial -lz
                  -lhdf5_serial -lhdf5_serial_hl >&5
configure:11043: $? = 0
configure:11052: result: yes
configure:11188: checking for clock_gettime in -lrt
configure:11213: gcc -o conftest -g -O2   -Wl,--no-as-needed conftest.c -lrt  
>&5
configure:11213: $? = 0
configure:11222: result: yes
configure:11520: checking JAVA_HOME variable
configure:11525: result: JAVA_HOME variable found, use it as JVM root
directory
configure:11673: checking for zip or jar files to include on CLASSPATH
Using CLASSPATH=
configure:11700: result:
configure:11709: checking to see if the java compiler works
/usr/lib/jvm/java-8-oracle/bin/javac -g conftest.java
yes
configure:11775: result: yes
Using JAVAC=/usr/lib/jvm/java-8-oracle/bin/javac
Java found in /usr/lib/jvm/java-8-oracle
configure:11794: checking type of jvm
/usr/lib/jvm/java-8-oracle/bin/javac -g conftest.java
conftest.java:4: error: package gnu.java.io does not exist
import gnu.java.io.EncodingManager;
                  ^
1 error
configure: failed program was:
// #line 11800 "configure"
import java.util.regex.Pattern;

import gnu.java.io.EncodingManager;

public class conftest {
    public static void main(String[] argv) {

    }

    private static int compare(String v1, String v2) {
        String s1 = normalisedVersion(v1);
        String s2 = normalisedVersion(v2);
        return s1.compareTo(s2);
    }

    private static String normalisedVersion(String version) {
        return normalisedVersion(version, ".", 4);
    }

    private static String normalisedVersion(String version, String sep, int
maxWidth) {
        String[] split = Pattern.compile(sep,
Pattern.LITERAL).split(version);
        StringBuilder sb = new StringBuilder();
        for (String s : split) {
            sb.append(String.format("%" + maxWidth + 's', s));
        }
        return sb.toString();
    }
}
configure: CLASSPATH was
configure:11867: result: jdk
configure:11878: checking java API version
/usr/lib/jvm/java-8-oracle/bin/javac -g conftest.java
yes
/usr/lib/jvm/java-8-oracle/bin/javac -g conftest.java
yes
/usr/lib/jvm/java-8-oracle/bin/javac -g conftest.java
yes
/usr/lib/jvm/java-8-oracle/bin/javac -g conftest.java
yes
/usr/lib/jvm/java-8-oracle/bin/javac -g conftest.java
yes
/usr/lib/jvm/java-8-oracle/bin/javac -g conftest.java
conftest.java:4: error: cannot find symbol
import java.lang.ProcessHandle;
                ^
  symbol:   class ProcessHandle
  location: package java.lang
1 error
configure: failed program was:
// #line 12209 "configure"
import java.util.regex.Pattern;

import java.lang.ProcessHandle;

public class conftest {
    public static void main(String[] argv) {

    }

    private static int compare(String v1, String v2) {
        String s1 = normalisedVersion(v1);
        String s2 = normalisedVersion(v2);
        return s1.compareTo(s2);
    }

    private static String normalisedVersion(String version) {
        return normalisedVersion(version, ".", 4);
    }

    private static String normalisedVersion(String version, String sep, int
maxWidth) {
        String[] split = Pattern.compile(sep,
Pattern.LITERAL).split(version);
        StringBuilder sb = new StringBuilder();
        for (String s : split) {
            sb.append(String.format("%" + maxWidth + 's', s));
        }
        return sb.toString();
    }
}
configure: CLASSPATH was
configure:12275: result: 1.8
Using the following JNI include flags -I/usr/lib/jvm/java-8-oracle/include
-I/usr/lib/jvm/java-8-oracle/include/linux
configure:12339: checking if jni.h can be included
configure:12366: gcc -c -g -O2 -I/usr/lib/jvm/java-8-oracle/include
-I/usr/lib/jvm/java-8-oracle/include/linux  conftest.c >&5
configure:12366: $? = 0
configure:12381: result: yes
Looking for JNI libs with x86_64 as machine hardware name
Looking for /usr/lib/jvm/java-8-oracle/lib/libjava.so
Looking for /usr/lib/jvm/java-8-oracle/jre/lib/x86_64/libjava.so
Looking for /usr/lib/jvm/java-8-oracle/jre/lib/amd64/libjava.so
Found /usr/lib/jvm/java-8-oracle/jre/lib/amd64/libjava.so
Using the following JNI library flags
-L/usr/lib/jvm/java-8-oracle/jre/lib/amd64 -ljava -lverify
-L/usr/lib/jvm/java-8-oracle/jre/lib/amd64/server -ljvm
Using the following runtime library path
/usr/lib/jvm/java-8-oracle/jre/lib/amd64:/usr/lib/jvm/java-8-oracle/jre/lib/amd64/server
Using LD_PRELOAD=
Using LD_BIND_NOW=
configure:12666: checking to see if we can link a JNI application
configure:12695: gcc -o conftest -g -O2 -I/usr/lib/jvm/java-8-oracle/include
-I/usr/lib/jvm/java-8-oracle/include/linux   -Wl,--no-as-needed conftest.c
-L/usr/lib/jvm/java-8-oracle/jre/lib/amd64 -ljava -lverify
-L/usr/lib/jvm/java-8-oracle/jre/lib/amd64/server -ljvm >&5
configure:12695: $? = 0
configure:12712: result: yes
configure:12780: checking for zip or jar files to include on CLASSPATH
Using CLASSPATH=
configure:12807: result:
configure:12860: checking for java
configure:12878: found /usr/lib/jvm/java-8-oracle/bin/java
configure:12890: result: /usr/lib/jvm/java-8-oracle/bin/java
configure:12955: checking for java_g
configure:12988: result: no
configure:13050: checking for javah
configure:13068: found /usr/lib/jvm/java-8-oracle/bin/javah
configure:13080: result: /usr/lib/jvm/java-8-oracle/bin/javah
configure:13144: checking for jar
configure:13162: found /usr/lib/jvm/java-8-oracle/bin/jar
configure:13174: result: /usr/lib/jvm/java-8-oracle/bin/jar
configure:13238: checking for javadoc
configure:13256: found /usr/lib/jvm/java-8-oracle/bin/javadoc
configure:13268: result: /usr/lib/jvm/java-8-oracle/bin/javadoc
configure:13333: checking for jdb
configure:13351: found /usr/lib/jvm/java-8-oracle/bin/jdb
configure:13363: result: /usr/lib/jvm/java-8-oracle/bin/jdb
configure:13543: checking for ant
configure:13561: found /usr/bin/ant
configure:13573: result: /usr/bin/ant
/usr/lib/jvm/java-8-oracle/bin/javac -g conftestSharedChecker.java
configure: conftestSharedChecker.class available
configure:13882: checking jgraphx
/usr/lib/jvm/java-8-oracle/bin/java conftestSharedChecker jgraphx
com.mxgraph.view.mxGraph . VERSION 2.0.0.1
com.mxgraph.view.mxGraph not found
configure:14081: result: no
configure:14087: error: Could not find or use the Java package/jar jgraphx
used by Diagram design (looking for package com.mxgraph.view.mxGraph)

## ---------------- ##
## Cache variables. ##
## ---------------- ##

ac_cv_build=x86_64-unknown-linux-gnu
ac_cv_c_compiler_gnu=yes
ac_cv_cxx_compiler_gnu=yes
ac_cv_env_BLAS_CFLAGS_set=
ac_cv_env_BLAS_CFLAGS_value=
ac_cv_env_BLAS_LIBS_set=
ac_cv_env_BLAS_LIBS_value=
ac_cv_env_CCC_set=
ac_cv_env_CCC_value=
ac_cv_env_CC_set=
ac_cv_env_CC_value=
ac_cv_env_CFLAGS_set=
ac_cv_env_CFLAGS_value=
ac_cv_env_CPPFLAGS_set=
ac_cv_env_CPPFLAGS_value=
ac_cv_env_CPP_set=
ac_cv_env_CPP_value=
ac_cv_env_CURL_CFLAGS_set=
ac_cv_env_CURL_CFLAGS_value=
ac_cv_env_CURL_LIBS_set=
ac_cv_env_CURL_LIBS_value=
ac_cv_env_CXXCPP_set=
ac_cv_env_CXXCPP_value=
ac_cv_env_CXXFLAGS_set=
ac_cv_env_CXXFLAGS_value=
ac_cv_env_CXX_set=
ac_cv_env_CXX_value=
ac_cv_env_F77_set=
ac_cv_env_F77_value=
ac_cv_env_FFLAGS_set=
ac_cv_env_FFLAGS_value=
ac_cv_env_LDFLAGS_set=
ac_cv_env_LDFLAGS_value=
ac_cv_env_LIBS_set=
ac_cv_env_LIBS_value=
ac_cv_env_LT_SYS_LIBRARY_PATH_set=
ac_cv_env_LT_SYS_LIBRARY_PATH_value=
ac_cv_env_MATIO_CFLAGS_set=
ac_cv_env_MATIO_CFLAGS_value=
ac_cv_env_MATIO_LIBS_set=
ac_cv_env_MATIO_LIBS_value=
ac_cv_env_PCRE_CFLAGS_set=
ac_cv_env_PCRE_CFLAGS_value=
ac_cv_env_PCRE_LIBS_set=
ac_cv_env_PCRE_LIBS_value=
ac_cv_env_PKG_CONFIG_set=
ac_cv_env_PKG_CONFIG_value=
ac_cv_env_VALGRIND_CFLAGS_set=
ac_cv_env_VALGRIND_CFLAGS_value=
ac_cv_env_VALGRIND_LIBS_set=
ac_cv_env_VALGRIND_LIBS_value=
ac_cv_env_XMKMF_set=
ac_cv_env_XMKMF_value=
ac_cv_env_YACC_set=
ac_cv_env_YACC_value=
ac_cv_env_YFLAGS_set=
ac_cv_env_YFLAGS_value=
ac_cv_env_build_alias_set=
ac_cv_env_build_alias_value=
ac_cv_env_host_alias_set=
ac_cv_env_host_alias_value=
ac_cv_env_target_alias_set=
ac_cv_env_target_alias_value=
ac_cv_f77_compiler_gnu=yes
ac_cv_header_hdf5_serial_hdf5_h=yes
ac_cv_header_inttypes_h=yes
ac_cv_header_memory_h=yes
ac_cv_header_stdc=yes
ac_cv_header_stdint_h=yes
ac_cv_header_stdlib_h=yes
ac_cv_header_string_h=yes
ac_cv_header_strings_h=yes
ac_cv_header_sys_stat_h=yes
ac_cv_header_sys_types_h=yes
ac_cv_header_unistd_h=yes
ac_cv_host=x86_64-unknown-linux-gnu
ac_cv_java_jvm_jni_working=yes
ac_cv_java_jvm_working_jni_link=yes
ac_cv_lib_hdf5_serial_H5Fopen=yes
ac_cv_lib_rt_clock_gettime=yes
ac_cv_objext=o
ac_cv_path_ANT=/usr/bin/ant
ac_cv_path_EGREP='/bin/grep -E'
ac_cv_path_GREP=/bin/grep
ac_cv_path_JAR=/usr/lib/jvm/java-8-oracle/bin/jar
ac_cv_path_JAVA=/usr/lib/jvm/java-8-oracle/bin/java
ac_cv_path_JAVADOC=/usr/lib/jvm/java-8-oracle/bin/javadoc
ac_cv_path_JAVAH=/usr/lib/jvm/java-8-oracle/bin/javah
ac_cv_path_JDB=/usr/lib/jvm/java-8-oracle/bin/jdb
ac_cv_path_ac_pt_PKG_CONFIG=/usr/bin/pkg-config
ac_cv_path_install='/usr/bin/install -c'
ac_cv_path_mkdir=/bin/mkdir
ac_cv_prog_AWK=mawk
ac_cv_prog_CPP='gcc -E'
ac_cv_prog_NM=nm
ac_cv_prog_ac_ct_AR=ar
ac_cv_prog_ac_ct_CC=gcc
ac_cv_prog_ac_ct_CXX=g++
ac_cv_prog_ac_ct_F77=gfortran
ac_cv_prog_cc_c89=
ac_cv_prog_cc_g=yes
ac_cv_prog_cxx_g=yes
ac_cv_prog_cxx_present=yes
ac_cv_prog_f77_c_o=yes
ac_cv_prog_f77_g=yes
ac_cv_prog_make_make_set=yes
ac_cv_sizeof_int=4
ac_cv_sizeof_long=8
ac_cv_sys_file_offset_bits=no
ac_cv_sys_largefile_CC=no
acl_cv_hardcode_direct=no
acl_cv_hardcode_libdir_flag_spec='${wl}-rpath ${wl}$libdir'
acl_cv_hardcode_libdir_separator=
acl_cv_hardcode_minus_L=no
acl_cv_libext=a
acl_cv_libpath=LD_LIBRARY_PATH
acl_cv_path_LD=/usr/bin/ld
acl_cv_prog_gnu_ld=yes
acl_cv_rpath=done
acl_cv_shlibext=so
acl_cv_shlibpath_var=LD_LIBRARY_PATH
acl_cv_wl=-Wl,
am_cv_CC_dependencies_compiler_type=gcc3
am_cv_CXX_dependencies_compiler_type=gcc3
am_cv_ar_interface=ar
am_cv_make_support_nested_variables=yes
am_cv_prog_cc_c_o=yes
ax_cv_cxx_compile_cxx11=no
ax_cv_cxx_compile_cxx11__std_cpp11=yes

## ----------------- ##
## Output variables. ##
## ----------------- ##

ACLOCAL='${SHELL} /home/codebuster/scilab_master/scilab/config/missing
aclocal-1.15'
ALL_LINGUAS=''
ALL_LINGUAS_DOC=''
AMDEPBACKSLASH='\'
AMDEP_FALSE='#'
AMDEP_TRUE=''
AMTAR='$${TAR-tar}'
AM_BACKSLASH='\'
AM_DEFAULT_V='$(AM_DEFAULT_VERBOSITY)'
AM_DEFAULT_VERBOSITY='1'
AM_V='$(V)'
ANT='/usr/bin/ant'
ANTLR=''
AR='ar'
ARPACK_LIBS=''
ARPACK_NG_FALSE=''
ARPACK_NG_TRUE=''
ASM3=''
AUTOCONF='${SHELL} /home/codebuster/scilab_master/scilab/config/missing
autoconf'
AUTOHEADER='${SHELL} /home/codebuster/scilab_master/scilab/config/missing
autoheader'
AUTOMAKE='${SHELL} /home/codebuster/scilab_master/scilab/config/missing
automake-1.15'
AVALON_FRAMEWORK=''
AWK='mawk'
BATIK=''
BLAS_CFLAGS=''
BLAS_LIBS=''
BUILD_HELP_FALSE=''
BUILD_HELP_TRUE=''
BUILD_PARSER_FALSE=''
BUILD_PARSER_TRUE='#'
CC='gcc'
CCACHE=''
CCDEPMODE='depmode=gcc3'
CFLAGS='-g -O2'
CHECKSTYLE=''
COBERTURA=''
CODE_COVERAGE_FALSE=''
CODE_COVERAGE_TRUE='#'
COMMONS_BEANUTILS=''
COMMONS_IO=''
COMMONS_LOGGING=''
COMPILATION_TESTS_FALSE=''
COMPILATION_TESTS_TRUE=''
CPP='gcc -E'
CPPFLAGS=''
CURL_CFLAGS=''
CURL_CONFIG=''
CURL_LIBS=''
CURL_VERSION=''
CXX='g++'
CXXCPP=''
CXXDEPMODE='depmode=gcc3'
CXXFLAGS=''
CYGPATH_W='echo'
DEFS=''
DEMOTOOLS_ENABLE=''
DEPDIR='.deps'
DLLTOOL=''
DOCBOOK_ROOT=''
DOXYGEN_BIN=''
DOXYGEN_FALSE=''
DOXYGEN_TRUE=''
DSYMUTIL=''
DUMPBIN=''
ECHO_C=''
ECHO_N='-n'
ECHO_T=''
ECJ=''
EGREP='/bin/grep -E'
EIGEN_CPPFLAGS=''
ENABLE_DEBUG_FALSE=''
ENABLE_DEBUG_TRUE='#'
ENABLE_STATIC_FALSE=''
ENABLE_STATIC_TRUE=''
EXEEXT=''
EXTERNAL_SCIRENDERER_FALSE=''
EXTERNAL_SCIRENDERER_TRUE='#'
F77='gfortran'
FFLAGS=''
FFTW3_LIB=''
FFTW_ENABLE=''
FFTW_FALSE=''
FFTW_TRUE=''
FGREP=''
FLEXDOCK=''
FLIBS=''
FOP=''
FORCE_LINK_FALSE=''
FORCE_LINK_TRUE=''
FREEHEP_GRAPHICS2D=''
FREEHEP_GRAPHICSIO=''
FREEHEP_GRAPHICSIO_EMF=''
FREEHEP_IO=''
FREEHEP_UTIL=''
GENERATE_LOCALIZATION_FILES_FALSE=''
GENERATE_LOCALIZATION_FILES_TRUE=''
GENHTML=''
GETTEXT_MACRO_VERSION=''
GIWS_BIN=''
GIWS_FALSE=''
GIWS_TRUE=''
GLUEGEN2_RT=''
GMSGFMT=''
GMSGFMT_015=''
GRAPHICS_ENABLE=''
GREP='/bin/grep'
GUI_ENABLE=''
GUI_FALSE=''
GUI_TRUE=''
HAMCREST=''
HAVE_CXX11=''
HDF5_CFLAGS='-I/usr/include/hdf5/serial'
HDF5_LIBS='-lhdf5_serial -lhdf5_serial_hl'
HELP_ENABLE=''
INSTALL_DATA='${INSTALL} -m 644'
INSTALL_HELP_XML_FALSE=''
INSTALL_HELP_XML_TRUE=''
INSTALL_PROGRAM='${INSTALL}'
INSTALL_SCRIPT='${INSTALL}'
INSTALL_STRIP_PROGRAM='$(install_sh) -c -s'
INTLLIBS=''
INTL_MACOSX_LIBS=''
IS_64_BITS_CPU_FALSE='#'
IS_64_BITS_CPU_TRUE=''
IS_HPUX_FALSE=''
IS_HPUX_TRUE='#'
IS_MACOSX_FALSE=''
IS_MACOSX_TRUE='#'
IS_MIPS_SGI_IRIX_FALSE=''
IS_MIPS_SGI_IRIX_TRUE='#'
IS_SOLARIS_FALSE=''
IS_SOLARIS_TRUE='#'
IS_SPARC_FALSE=''
IS_SPARC_TRUE='#'
JAR='/usr/lib/jvm/java-8-oracle/bin/jar'
JAVA='/usr/lib/jvm/java-8-oracle/bin/java'
JAVAC='/usr/lib/jvm/java-8-oracle/bin/javac'
JAVAC_DEBUG=''
JAVADOC='/usr/lib/jvm/java-8-oracle/bin/javadoc'
JAVAH='/usr/lib/jvm/java-8-oracle/bin/javah'
JAVASCI_ENABLE=''
JAVASCI_FALSE=''
JAVASCI_TRUE=''
JAVA_ENABLE=''
JAVA_G='/usr/lib/jvm/java-8-oracle/bin/java'
JAVA_HOME='/usr/lib/jvm/java-8-oracle'
JAVA_JNI_INCLUDE='-I/usr/lib/jvm/java-8-oracle/include
-I/usr/lib/jvm/java-8-oracle/include/linux'
JAVA_JNI_LIBS='-L/usr/lib/jvm/java-8-oracle/jre/lib/amd64 -ljava -lverify
-L/usr/lib/jvm/java-8-oracle/jre/lib/amd64/server -ljvm'
JDB='/usr/lib/jvm/java-8-oracle/bin/jdb'
JEUCLID_CORE=''
JGRAPHX=''
JHALL=''
JLATEXMATH=''
JLATEXMATH_FOP=''
JOGL2=''
JROSETTA_API=''
JROSETTA_ENGINE=''
JUNIT4=''
LAPACK_LIBS=''
LCOV=''
LD='/usr/bin/ld'
LDFLAGS=' -Wl,--no-as-needed'
LEX=''
LEXLIB=''
LEX_OUTPUT_ROOT=''
LIBICONV=''
LIBINTL=''
LIBM=''
LIBOBJS=''
LIBS=''
LIBTOOL=''
LIPO=''
LN_S='ln -s'
LOGGING_LEVEL='SEVERE'
LOOKS=''
LTLIBICONV=''
LTLIBINTL=''
LTLIBOBJS=''
LT_SYS_LIBRARY_PATH=''
LUCENE=''
LUCENE_ANALYZER=''
LUCENE_PARSER=''
MAINT='#'
MAINTAINER_MODE_FALSE=''
MAINTAINER_MODE_TRUE='#'
MAKEINFO='${SHELL} /home/codebuster/scilab_master/scilab/config/missing
makeinfo'
MANIFEST_TOOL=''
MATIO_CFLAGS=''
MATIO_ENABLE=''
MATIO_FALSE=''
MATIO_LIBS=''
MATIO_TRUE=''
MKDIR_P='/bin/mkdir -p'
MPI_ENABLE=''
MPI_FALSE=''
MPI_TRUE=''
MSGCAT=''
MSGFMT=''
MSGFMT_015=''
MSGMERGE=''
NEED_JAVA_FALSE=''
NEED_JAVA_TRUE=''
NM='nm'
NMEDIT=''
OBJDUMP=''
OBJEXT='o'
OCAMLC=''
OCAMLDEP=''
OCAMLLEX=''
OCAMLOPT=''
OCAMLYACC=''
OCAML_FALSE=''
OCAML_TRUE='#'
OPENMPI_CC=''
OPENMPI_CFLAGS=''
OPENMPI_CXX=''
OPENMPI_CXXFLAGS=''
OPENMPI_LIBS=''
OPENMP_CFLAGS=''
OPENMP_CXXFLAGS=''
OPENMP_ENABLE=''
OPENMP_FALSE=''
OPENMP_LIBS=''
OPENMP_TRUE=''
OTOOL64=''
OTOOL=''
PACKAGE='scilab'
PACKAGE_BUGREPORT='http://bugzilla.scilab.org/'
PACKAGE_NAME='Scilab'
PACKAGE_STRING='Scilab 6'
PACKAGE_TARNAME='scilab'
PACKAGE_URL=''
PACKAGE_VERSION='6'
PATH_SEPARATOR=':'
PCRE_CFLAGS=''
PCRE_CONFIG=''
PCRE_LIBS=''
PCRE_VERSION=''
PKG_CONFIG='/usr/bin/pkg-config'
POSUB=''
POW_LIB=''
PYTHON=''
RANLIB=''
RELOCATABLE='no'
RELOCATABLE_VIA_LD_FALSE=''
RELOCATABLE_VIA_LD_TRUE='#'
RT_LIB='-lrt'
SAXON=''
SCILAB_BINARY_VERSION='6.1.0'
SCILAB_LIBRARY_VERSION='6:1:0'
SCILAB_VERSION_MAINTENANCE='0'
SCILAB_VERSION_MAJOR='6'
SCILAB_VERSION_MINOR='1'
SCIRENDERER=''
SCIRENDERER_CP=''
SCI_CFLAGS=''
SCI_CXXFLAGS=''
SCI_FFLAGS=''
SCI_LDFLAGS=''
SED=''
SET_MAKE=''
SET_RELOCATABLE=''
SHELL='/bin/bash'
SKINLF=''
SPLINT=''
STRIP=''
SWIG_BIN=''
SWIG_FALSE=''
SWIG_JAVA=''
SWIG_RUNTIME_LIBS_DIR=''
SWIG_SCILAB=''
SWIG_TRUE=''
TCLTK_FALSE=''
TCLTK_LIBS=''
TCLTK_TRUE=''
TCL_INC_PATH=''
TK_INC_PATH=''
UMFPACK_CFLAGS=''
UMFPACK_ENABLE=''
UMFPACK_FALSE=''
UMFPACK_LIB=''
UMFPACK_TRUE=''
USE_NLS=''
USE_STATIC_SYSTEM_LIB_FALSE=''
USE_STATIC_SYSTEM_LIB_TRUE=''
VALGRIND_CFLAGS=''
VALGRIND_LIBS=''
VERSION='6'
WITH_OCAML=''
WITH_TKSCI=''
XCOS_ENABLE='yes'
XCOS_FALSE='#'
XCOS_TRUE=''
XGETTEXT=''
XGETTEXT_015=''
XGETTEXT_EXTRA_OPTIONS=''
XMKMF=''
XMLGRAPHICS_COMMONS=''
XML_APIS_EXT=''
XML_CONFIG=''
XML_FLAGS=''
XML_LIBS=''
XML_VERSION=''
X_CFLAGS=''
X_EXTRA_LIBS=''
X_LIBS=''
X_PRE_LIBS=''
YACC=''
YFLAGS=''
ac_ct_AR='ar'
ac_ct_CC='gcc'
ac_ct_CXX='g++'
ac_ct_DUMPBIN=''
ac_ct_F77='gfortran'
am__EXEEXT_FALSE=''
am__EXEEXT_TRUE=''
am__fastdepCC_FALSE='#'
am__fastdepCC_TRUE=''
am__fastdepCXX_FALSE='#'
am__fastdepCXX_TRUE=''
am__include='include'
am__isrc=''
am__leading_dot='.'
am__nodep='_no'
am__quote=''
am__tar='$${TAR-tar} chof - "$$tardir"'
am__untar='$${TAR-tar} xf -'
bindir='${exec_prefix}/bin'
build='x86_64-unknown-linux-gnu'
build_alias=''
build_cpu='x86_64'
build_os='linux-gnu'
build_vendor='unknown'
cxx_present='yes'
datadir='${datarootdir}'
datarootdir='${prefix}/share'
docdir='${datarootdir}/doc/${PACKAGE_TARNAME}'
dvidir='${docdir}'
exec_prefix='NONE'
host='x86_64-unknown-linux-gnu'
host_alias=''
host_cpu='x86_64'
host_os='linux-gnu'
host_vendor='unknown'
htmldir='${docdir}'
includedir='${prefix}/include'
infodir='${datarootdir}/info'
install_sh='${SHELL}
/home/codebuster/scilab_master/scilab/config/install-sh'
libdir='${exec_prefix}/lib'
libexecdir='${exec_prefix}/libexec'
localedir='${datarootdir}/locale'
localstatedir='${prefix}/var'
mandir='${datarootdir}/man'
mkdir_p='$(MKDIR_P)'
oldincludedir='/usr/include'
pdfdir='${docdir}'
prefix='/usr/local'
program_transform_name='s,x,x,'
psdir='${docdir}'
sbindir='${exec_prefix}/sbin'
sharedstatedir='${prefix}/com'
sysconfdir='${prefix}/etc'
target_alias=''
yacc_present=''

## ----------- ##
## confdefs.h. ##
## ----------- ##

/* confdefs.h */
#define PACKAGE_NAME "Scilab"
#define PACKAGE_TARNAME "scilab"
#define PACKAGE_VERSION "6"
#define PACKAGE_STRING "Scilab 6"
#define PACKAGE_BUGREPORT "http://bugzilla.scilab.org/"
#define PACKAGE_URL ""
#define INSTALLPREFIX "/usr/local"
#define STDC_HEADERS 1
#define HAVE_SYS_TYPES_H 1
#define HAVE_SYS_STAT_H 1
#define HAVE_STDLIB_H 1
#define HAVE_STRING_H 1
#define HAVE_MEMORY_H 1
#define HAVE_STRINGS_H 1
#define HAVE_INTTYPES_H 1
#define HAVE_STDINT_H 1
#define HAVE_UNISTD_H 1
#define INSTALLPREFIX "/usr/local"
#define PACKAGE "scilab"
#define VERSION "6"
#define G95_FORTRAN /**/
#define SIZEOF_INT 4
#define SIZEOF_LONG 8
#define WTU /**/
#define CNAME(name1,name2) name1##name2
#define C2F(name) name##_
#define F2C(name) name##_
#define HAVE_LIBHDF5_SERIAL 1
#define WITH_HDF5 /**/
#define WITH_XCOS /**/
#define HAVE_CLOCK_GETTIME 1

configure: exit 1


System - Ubuntu 16.04 LTS

JGraphX version: 83-23



--
Sent from: http://mailinglists.scilab.org/Scilab-GSOC-Mailing-Lists-Archives-f2646148.html
_______________________________________________
gsoc mailing list
[hidden email]
http://lists.scilab.org/mailman/listinfo/gsoc
Clément David-3 Clément David-3
Reply | Threaded
Open this post in threaded view
|

Re: Scilab Compilation error

Hello,

Thanks for the config.log ; JGraphX is not correcltly detected and AFAIK the version 83-23 is not a
valid one. Could you try with our prerequirements svn [1] ?

[1]: https://wiki.scilab.org/Compilation%20of%20Scilab

Thanks,

--
Clément

Le jeudi 08 mars 2018 à 16:26 -0700, Diganta Dutta a écrit :
> System - Ubuntu 16.04 LTS
>
> JGraphX version: 83-23
_______________________________________________
gsoc mailing list
[hidden email]
http://lists.scilab.org/mailman/listinfo/gsoc