Scilab-5.1 make install error

classic Classic list List threaded Threaded
4 messages Options
Soren Hansen Soren Hansen
Reply | Threaded
Open this post in threaded view
|

Scilab-5.1 make install error

Hello all!

I am trying to install Scilab-5.1 from source on a machine running Linux Ubuntu 8.04. I have managed to get the source compiled but when I issue 'sudo make install' it returns with the following error:

/usr/bin/install -c -m 644 ./examples//ihm/Readme /usr/local/share/scilab/modules/javasci/examples//ihm
/usr/bin/install: cannot stat `./examples//ihm/Readme': No such file or directory
/usr/bin/install -c -m 644 ./examples/(Windows).txt /usr/local/share/scilab/modules/javasci/examples
/usr/bin/install: cannot stat `./examples/(Windows).txt': No such file or directory
make[3]: *** [install-data-local] Error 1
make[3]: Leaving directory `/home/sh/proggy/scilab-5.1/modules/javasci'
make[2]: *** [install-am] Error 2
make[2]: Leaving directory `/home/sh/proggy/scilab-5.1/modules/javasci'
make[1]: *** [install-recursive] Error 1
make[1]: Leaving directory `/home/sh/proggy/scilab-5.1/modules'
make: *** [install-recursive] Error 1


Any help on how to fix this would be appreciated.

Thank you in advance
 - Soren Hansen
Christoph Korn Christoph Korn
Reply | Threaded
Open this post in threaded view
|

Re: Scilab-5.1 make install error

It is a known issue.

Please apply the attached patch before building.

Christoph

Soren Hansen schrieb:

> Hello all!
>
> I am trying to install Scilab-5.1 from source on a machine running Linux
> Ubuntu 8.04. I have managed to get the source compiled but when I issue
> 'sudo make install' it returns with the following error:
>
> /usr/bin/install -c -m 644 ./examples//ihm/Readme
> /usr/local/share/scilab/modules/javasci/examples//ihm
> /usr/bin/install: cannot stat `./examples//ihm/Readme': No such file or
> directory
> /usr/bin/install -c -m 644 ./examples/(Windows).txt
> /usr/local/share/scilab/modules/javasci/examples
> /usr/bin/install: cannot stat `./examples/(Windows).txt': No such file or
> directory
> make[3]: *** [install-data-local] Error 1
> make[3]: Leaving directory `/home/sh/proggy/scilab-5.1/modules/javasci'
> make[2]: *** [install-am] Error 2
> make[2]: Leaving directory `/home/sh/proggy/scilab-5.1/modules/javasci'
> make[1]: *** [install-recursive] Error 1
> make[1]: Leaving directory `/home/sh/proggy/scilab-5.1/modules'
> make: *** [install-recursive] Error 1
>
>
> Any help on how to fix this would be appreciated.
>
> Thank you in advance
>  - Soren Hansen
>

diff -Nur scilab-5.1.orig/modules/javasci/examples/ihm/Readme (Windows).txt scilab-5.1/modules/javasci/examples/ihm/Readme (Windows).txt
--- scilab-5.1.orig/modules/javasci/examples/ihm/Readme (Windows).txt 2009-02-12 14:17:10.000000000 +0100
+++ scilab-5.1/modules/javasci/examples/ihm/Readme (Windows).txt 1970-01-01 01:00:00.000000000 +0100
@@ -1,6 +0,0 @@
-execute Make.bat to compile this example
-
-execute Test-ihm.bat to test this example
-
-Allan CORNET
-
diff -Nur scilab-5.1.orig/modules/javasci/examples/ihm/Readme_Windows_.txt scilab-5.1/modules/javasci/examples/ihm/Readme_Windows_.txt
--- scilab-5.1.orig/modules/javasci/examples/ihm/Readme_Windows_.txt 1970-01-01 01:00:00.000000000 +0100
+++ scilab-5.1/modules/javasci/examples/ihm/Readme_Windows_.txt 2009-02-12 14:17:10.000000000 +0100
@@ -0,0 +1,6 @@
+execute Make.bat to compile this example
+
+execute Test-ihm.bat to test this example
+
+Allan CORNET
+
diff -Nur scilab-5.1.orig/modules/javasci/examples/others/Readme (Windows).txt scilab-5.1/modules/javasci/examples/others/Readme (Windows).txt
--- scilab-5.1.orig/modules/javasci/examples/others/Readme (Windows).txt 2009-02-12 14:17:10.000000000 +0100
+++ scilab-5.1/modules/javasci/examples/others/Readme (Windows).txt 1970-01-01 01:00:00.000000000 +0100
@@ -1,9 +0,0 @@
-execute Make.bat to compile these examples
-
-or "ant jar" in this directory
-
-execute :
- Examples.bat
-
-Allan CORNET
-
diff -Nur scilab-5.1.orig/modules/javasci/examples/others/Readme_Windows_.txt scilab-5.1/modules/javasci/examples/others/Readme_Windows_.txt
--- scilab-5.1.orig/modules/javasci/examples/others/Readme_Windows_.txt 1970-01-01 01:00:00.000000000 +0100
+++ scilab-5.1/modules/javasci/examples/others/Readme_Windows_.txt 2009-02-12 14:17:10.000000000 +0100
@@ -0,0 +1,9 @@
+execute Make.bat to compile these examples
+
+or "ant jar" in this directory
+
+execute :
+ Examples.bat
+
+Allan CORNET
+
Soren Hansen Soren Hansen
Reply | Threaded
Open this post in threaded view
|

Re: Scilab-5.1 make install error

Thank you, that did the trick !

 - Soren

On Thu, Feb 26, 2009 at 4:38 PM, Christoph Korn <[hidden email]> wrote:
It is a known issue.

Please apply the attached patch before building.

Christoph

Soren Hansen schrieb:
> Hello all!
>
> I am trying to install Scilab-5.1 from source on a machine running Linux
> Ubuntu 8.04. I have managed to get the source compiled but when I issue
> 'sudo make install' it returns with the following error:
>
> /usr/bin/install -c -m 644 ./examples//ihm/Readme
> /usr/local/share/scilab/modules/javasci/examples//ihm
> /usr/bin/install: cannot stat `./examples//ihm/Readme': No such file or
> directory
> /usr/bin/install -c -m 644 ./examples/(Windows).txt
> /usr/local/share/scilab/modules/javasci/examples
> /usr/bin/install: cannot stat `./examples/(Windows).txt': No such file or
> directory
> make[3]: *** [install-data-local] Error 1
> make[3]: Leaving directory `/home/sh/proggy/scilab-5.1/modules/javasci'
> make[2]: *** [install-am] Error 2
> make[2]: Leaving directory `/home/sh/proggy/scilab-5.1/modules/javasci'
> make[1]: *** [install-recursive] Error 1
> make[1]: Leaving directory `/home/sh/proggy/scilab-5.1/modules'
> make: *** [install-recursive] Error 1
>
>
> Any help on how to fix this would be appreciated.
>
> Thank you in advance
>  - Soren Hansen
>

Sylvestre Ledru Sylvestre Ledru
Reply | Threaded
Open this post in threaded view
|

Re: Scilab-5.1 make install error

Btw, this patch has been applied upstream and will be available in
Scilab 5.1.1

Sylvestre

Le jeudi 26 février 2009 à 17:12 +0100, Soren Hansen a écrit :

> Thank you, that did the trick !
>
>  - Soren
>
> On Thu, Feb 26, 2009 at 4:38 PM, Christoph Korn <[hidden email]> wrote:
>         It is a known issue.
>        
>         Please apply the attached patch before building.
>        
>         Christoph
>        
>         Soren Hansen schrieb:
>        
>         > Hello all!
>         >
>         > I am trying to install Scilab-5.1 from source on a machine
>         running Linux
>         > Ubuntu 8.04. I have managed to get the source compiled but
>         when I issue
>         > 'sudo make install' it returns with the following error:
>         >
>         > /usr/bin/install -c -m 644 ./examples//ihm/Readme
>         > /usr/local/share/scilab/modules/javasci/examples//ihm
>         > /usr/bin/install: cannot stat `./examples//ihm/Readme': No
>         such file or
>         > directory
>         > /usr/bin/install -c -m 644 ./examples/(Windows).txt
>         > /usr/local/share/scilab/modules/javasci/examples
>         > /usr/bin/install: cannot stat `./examples/(Windows).txt': No
>         such file or
>         > directory
>         > make[3]: *** [install-data-local] Error 1
>         > make[3]: Leaving directory
>         `/home/sh/proggy/scilab-5.1/modules/javasci'
>         > make[2]: *** [install-am] Error 2
>         > make[2]: Leaving directory
>         `/home/sh/proggy/scilab-5.1/modules/javasci'
>         > make[1]: *** [install-recursive] Error 1
>         > make[1]: Leaving directory
>         `/home/sh/proggy/scilab-5.1/modules'
>         > make: *** [install-recursive] Error 1
>         >
>         >
>         > Any help on how to fix this would be appreciated.
>         >
>         > Thank you in advance
>         >  - Soren Hansen
>         >
>        
>