installation troubleshoot on Linux x86_64

classic Classic list List threaded Threaded
4 messages Options
Karl Delbé Karl Delbé
Reply | Threaded
Open this post in threaded view
|

installation troubleshoot on Linux x86_64

Dear all
I'm triying to install scilab on a Linux mandriva x86_64, but after
making the standard installation procedure, the soft doesn't work.

Is any body can help me  ?  Any user with similar architecture system?

Thanks in advance!

--
     **************************************************************
          Karl Delbé

          Université des Antilles et de la Guyane
          Faculté des Sciences Exactes et Naturelles
          Département de Physique
          Groupe de Technologie des Surfaces et Interfaces
 
          BP 592
          97159 Pointe-a-Pitre cedex
          Guadeloupe, FRANCE

          Tel:590 483 111     Fax: 590 483 105
          site oueb : www.univ-ag.fr/gtsi
     **************************************************************


Sylvestre Ledru Sylvestre Ledru
Reply | Threaded
Open this post in threaded view
|

Re: installation troubleshoot on Linux x86_64


Hello Karl,

On Sat, 05 Apr 2008 12:12:20 -0400, Karl Delbé <[hidden email]>
wrote:
> Dear all
> I'm triying to install scilab on a Linux mandriva x86_64, but after
> making the standard installation procedure, the soft doesn't work.
Please, could you be a bit more specific ? What do you mean by "doesn't
work" ? Any error/warning ?
Did you download the 32 bits binary from our website or did you try to
compile from the source ?

Regards,
Sylvestre


Karl Delbé Karl Delbé
Reply | Threaded
Open this post in threaded view
|

Re: installation troubleshoot on Linux x86_64

Hi Sylvestre,

first, I use a source version (*scilab-4.1.2-src.tar.gz*) for compilation.
With the command* tar zxvf scilab-4.1.2-src.tar.gz*, I uncompress the
package in */usr/local/*. Then, the directory * scilab-4.1.2/* is
created. In this directory, I launch the *./configure* command without
flag.
Everything seems to work well, I send you my *config.log *file in
attached document.
Finally, I launch the *make all* command, and the following message appear:
*
[root@pc539vl2 scilab-4.1.2]# make all
make: *** Pas de règle pour fabriquer la cible « all ». Arrêt.

*After checking the directory there is no Makfile but some Makefile.*

Did I make something wrong? Any subjection ?

*
*Sylvestre Ledru a écrit :

> Hello Karl,
>
> On Sat, 05 Apr 2008 12:12:20 -0400, Karl Delbé <[hidden email]>
> wrote:
>  
>> Dear all
>> I'm triying to install scilab on a Linux mandriva x86_64, but after
>> making the standard installation procedure, the soft doesn't work.
>>    
> Please, could you be a bit more specific ? What do you mean by "doesn't
> work" ? Any error/warning ?
> Did you download the 32 bits binary from our website or did you try to
> compile from the source ?
>
> Regards,
> Sylvestre
>
>  

--
     **************************************************************
          Karl Delbé

          Université des Antilles et de la Guyane
          Faculté des Sciences Exactes et Naturelles
          Département de Physique
          Groupe de Technologie des Surfaces et Interfaces
 
          BP 592
          97159 Pointe-a-Pitre cedex
          Guadeloupe, FRANCE

          Tel:590 483 111     Fax: 590 483 105
          site oueb : www.univ-ag.fr/gtsi
     **************************************************************


This file contains any messages produced by compilers while
running configure, to aid debugging if configure makes a mistake.

It was created by configure, which was
generated by GNU Autoconf 2.61.  Invocation command line was

  $ ./configure

## --------- ##
## Platform. ##
## --------- ##

hostname = pc539vl2.univ-ag.fr
uname -m = x86_64
uname -r = 2.6.17-17mdv
uname -s = Linux
uname -v = #1 SMP Mon Feb 11 12:28:53 EST 2008

/usr/bin/uname -p = unknown
/bin/uname -X     = unknown

/bin/arch              = x86_64
/usr/bin/arch -k       = unknown
/usr/convex/getsysinfo = unknown
/usr/bin/hostinfo      = unknown
/bin/machine           = unknown
/usr/bin/oslevel       = unknown
/bin/universe          = unknown

PATH: /sbin
PATH: /usr/sbin
PATH: /bin
PATH: /usr/bin
PATH: /usr/X11R6/bin
PATH: /usr/local/bin
PATH: /usr/local/sbin
PATH: /usr/lib/qt3//bin


## ----------- ##
## Core tests. ##
## ----------- ##

configure:2078: checking build system type
configure:2096: result: x86_64-unknown-linux-gnu
configure:2118: checking host system type
configure:2133: result: x86_64-unknown-linux-gnu
configure:2877: checking for gcc
configure:2893: found /usr/bin/gcc
configure:2904: result: gcc
configure:3142: checking for C compiler version
configure:3149: gcc --version >&5
gcc (GCC) 4.1.2 20070302 (prerelease) (4.1.2-1mdv2007.1)
Copyright (C) 2006 Free Software Foundation, Inc.
This is free software; see the source for copying conditions.  There is NO
warranty; not even for MERCHANTABILITY or FITNESS FOR A PARTICULAR PURPOSE.

configure:3152: $? = 0
configure:3159: gcc -v >&5
Using built-in specs.
Target: x86_64-mandriva-linux-gnu
Configured with: ../configure --prefix=/usr --libexecdir=/usr/lib --with-slibdir=/lib64 --mandir=/usr/share/man --infodir=/usr/share/info --enable-checking=release --enable-languages=c,c++,ada,fortran,objc,obj-c++,java --host=x86_64-mandriva-linux-gnu --with-cpu=generic --with-system-zlib --enable-threads=posix --enable-shared --enable-long-long --enable-__cxa_atexit --disable-libunwind-exceptions --enable-clocale=gnu --enable-java-awt=gtk --with-java-home=/usr/lib/jvm/java-1.4.2-gcj-1.4.2.0/jre --enable-gtk-cairo --disable-libjava-multilib --enable-ssp --disable-libssp
Thread model: posix
gcc version 4.1.2 20070302 (prerelease) (4.1.2-1mdv2007.1)
configure:3162: $? = 0
configure:3169: gcc -V >&5
gcc: '-V' option must have argument
configure:3172: $? = 1
configure:3195: checking for C compiler default output file name
configure:3222: gcc    conftest.c  >&5
configure:3225: $? = 0
configure:3263: result: a.out
configure:3280: checking whether the C compiler works
configure:3290: ./a.out
configure:3293: $? = 0
configure:3310: result: yes
configure:3317: checking whether we are cross compiling
configure:3319: result: no
configure:3322: checking for suffix of executables
configure:3329: gcc -o conftest    conftest.c  >&5
configure:3332: $? = 0
configure:3356: result:
configure:3362: checking for suffix of object files
configure:3388: gcc -c   conftest.c >&5
configure:3391: $? = 0
configure:3414: result: o
configure:3418: checking whether we are using the GNU C compiler
configure:3447: gcc -c   conftest.c >&5
configure:3453: $? = 0
configure:3470: result: yes
configure:3475: checking whether gcc accepts -g
configure:3505: gcc -c -g  conftest.c >&5
configure:3511: $? = 0
configure:3610: result: yes
configure:3627: checking for gcc option to accept ISO C89
configure:3701: gcc  -c -g -O2  conftest.c >&5
configure:3707: $? = 0
configure:3730: result: none needed
configure:3748: checking for a sed that does not truncate output
configure:3802: result: /bin/sed
configure:3805: checking for grep that handles long lines and -e
configure:3879: result: /bin/grep
configure:3884: checking for egrep
configure:3962: result: /bin/grep -E
configure:3978: checking for ld used by gcc
configure:4045: result: /usr/bin/ld
configure:4054: checking if the linker (/usr/bin/ld) is GNU ld
configure:4069: result: yes
configure:4074: checking for /usr/bin/ld option to reload object files
configure:4081: result: -r
configure:4099: checking for BSD-compatible nm
configure:4141: result: /usr/bin/nm -B
configure:4145: checking whether ln -s works
configure:4149: result: yes
configure:4156: checking how to recognise dependent libraries
configure:4328: result: pass_all
configure:4413: gcc -c -g -O2  conftest.c >&5
configure:4416: $? = 0
configure:4539: checking how to run the C preprocessor
configure:4579: gcc -E  conftest.c
configure:4585: $? = 0
configure:4616: gcc -E  conftest.c
conftest.c:8:28: error: ac_nonexistent.h: No such file or directory
configure:4622: $? = 1
configure: failed program was:
| /* confdefs.h.  */
| #define PACKAGE_NAME ""
| #define PACKAGE_TARNAME ""
| #define PACKAGE_VERSION ""
| #define PACKAGE_STRING ""
| #define PACKAGE_BUGREPORT ""
| /* end confdefs.h.  */
| #include <ac_nonexistent.h>
configure:4655: result: gcc -E
configure:4684: gcc -E  conftest.c
configure:4690: $? = 0
configure:4721: gcc -E  conftest.c
conftest.c:8:28: error: ac_nonexistent.h: No such file or directory
configure:4727: $? = 1
configure: failed program was:
| /* confdefs.h.  */
| #define PACKAGE_NAME ""
| #define PACKAGE_TARNAME ""
| #define PACKAGE_VERSION ""
| #define PACKAGE_STRING ""
| #define PACKAGE_BUGREPORT ""
| /* end confdefs.h.  */
| #include <ac_nonexistent.h>
configure:4765: checking for ANSI C header files
configure:4795: gcc -c -g -O2  conftest.c >&5
configure:4801: $? = 0
configure:4900: gcc -o conftest -g -O2   conftest.c  >&5
configure:4903: $? = 0
configure:4909: ./conftest
configure:4912: $? = 0
configure:4929: result: yes
configure:4953: checking for sys/types.h
configure:4974: gcc -c -g -O2  conftest.c >&5
configure:4980: $? = 0
configure:4996: result: yes
configure:4953: checking for sys/stat.h
configure:4974: gcc -c -g -O2  conftest.c >&5
configure:4980: $? = 0
configure:4996: result: yes
configure:4953: checking for stdlib.h
configure:4974: gcc -c -g -O2  conftest.c >&5
configure:4980: $? = 0
configure:4996: result: yes
configure:4953: checking for string.h
configure:4974: gcc -c -g -O2  conftest.c >&5
configure:4980: $? = 0
configure:4996: result: yes
configure:4953: checking for memory.h
configure:4974: gcc -c -g -O2  conftest.c >&5
configure:4980: $? = 0
configure:4996: result: yes
configure:4953: checking for strings.h
configure:4974: gcc -c -g -O2  conftest.c >&5
configure:4980: $? = 0
configure:4996: result: yes
configure:4953: checking for inttypes.h
configure:4974: gcc -c -g -O2  conftest.c >&5
configure:4980: $? = 0
configure:4996: result: yes
configure:4953: checking for stdint.h
configure:4974: gcc -c -g -O2  conftest.c >&5
configure:4980: $? = 0
configure:4996: result: yes
configure:4953: checking for unistd.h
configure:4974: gcc -c -g -O2  conftest.c >&5
configure:4980: $? = 0
configure:4996: result: yes
configure:5023: checking dlfcn.h usability
configure:5040: gcc -c -g -O2  conftest.c >&5
configure:5046: $? = 0
configure:5060: result: yes
configure:5064: checking dlfcn.h presence
configure:5079: gcc -E  conftest.c
configure:5085: $? = 0
configure:5099: result: yes
configure:5127: checking for dlfcn.h
configure:5135: result: yes
configure:5206: checking for g++
configure:5222: found /usr/bin/g++
configure:5233: result: g++
configure:5264: checking for C++ compiler version
configure:5271: g++ --version >&5
g++ (GCC) 4.1.2 20070302 (prerelease) (4.1.2-1mdv2007.1)
Copyright (C) 2006 Free Software Foundation, Inc.
This is free software; see the source for copying conditions.  There is NO
warranty; not even for MERCHANTABILITY or FITNESS FOR A PARTICULAR PURPOSE.

configure:5274: $? = 0
configure:5281: g++ -v >&5
Using built-in specs.
Target: x86_64-mandriva-linux-gnu
Configured with: ../configure --prefix=/usr --libexecdir=/usr/lib --with-slibdir=/lib64 --mandir=/usr/share/man --infodir=/usr/share/info --enable-checking=release --enable-languages=c,c++,ada,fortran,objc,obj-c++,java --host=x86_64-mandriva-linux-gnu --with-cpu=generic --with-system-zlib --enable-threads=posix --enable-shared --enable-long-long --enable-__cxa_atexit --disable-libunwind-exceptions --enable-clocale=gnu --enable-java-awt=gtk --with-java-home=/usr/lib/jvm/java-1.4.2-gcj-1.4.2.0/jre --enable-gtk-cairo --disable-libjava-multilib --enable-ssp --disable-libssp
Thread model: posix
gcc version 4.1.2 20070302 (prerelease) (4.1.2-1mdv2007.1)
configure:5284: $? = 0
configure:5291: g++ -V >&5
g++: '-V' option must have argument
configure:5294: $? = 1
configure:5297: checking whether we are using the GNU C++ compiler
configure:5326: g++ -c   conftest.cpp >&5
configure:5332: $? = 0
configure:5349: result: yes
configure:5354: checking whether g++ accepts -g
configure:5384: g++ -c -g  conftest.cpp >&5
configure:5390: $? = 0
configure:5489: result: yes
configure:5522: checking how to run the C++ preprocessor
configure:5558: g++ -E  conftest.cpp
configure:5564: $? = 0
configure:5595: g++ -E  conftest.cpp
conftest.cpp:19:28: error: ac_nonexistent.h: No such file or directory
configure:5601: $? = 1
configure: failed program was:
| /* confdefs.h.  */
| #define PACKAGE_NAME ""
| #define PACKAGE_TARNAME ""
| #define PACKAGE_VERSION ""
| #define PACKAGE_STRING ""
| #define PACKAGE_BUGREPORT ""
| #define STDC_HEADERS 1
| #define HAVE_SYS_TYPES_H 1
| #define HAVE_SYS_STAT_H 1
| #define HAVE_STDLIB_H 1
| #define HAVE_STRING_H 1
| #define HAVE_MEMORY_H 1
| #define HAVE_STRINGS_H 1
| #define HAVE_INTTYPES_H 1
| #define HAVE_STDINT_H 1
| #define HAVE_UNISTD_H 1
| #define HAVE_DLFCN_H 1
| /* end confdefs.h.  */
| #include <ac_nonexistent.h>
configure:5634: result: g++ -E
configure:5663: g++ -E  conftest.cpp
configure:5669: $? = 0
configure:5700: g++ -E  conftest.cpp
conftest.cpp:19:28: error: ac_nonexistent.h: No such file or directory
configure:5706: $? = 1
configure: failed program was:
| /* confdefs.h.  */
| #define PACKAGE_NAME ""
| #define PACKAGE_TARNAME ""
| #define PACKAGE_VERSION ""
| #define PACKAGE_STRING ""
| #define PACKAGE_BUGREPORT ""
| #define STDC_HEADERS 1
| #define HAVE_SYS_TYPES_H 1
| #define HAVE_SYS_STAT_H 1
| #define HAVE_STDLIB_H 1
| #define HAVE_STRING_H 1
| #define HAVE_MEMORY_H 1
| #define HAVE_STRINGS_H 1
| #define HAVE_INTTYPES_H 1
| #define HAVE_STDINT_H 1
| #define HAVE_UNISTD_H 1
| #define HAVE_DLFCN_H 1
| /* end confdefs.h.  */
| #include <ac_nonexistent.h>
configure:5799: checking for g77
configure:5829: result: no
configure:5799: checking for xlf
configure:5829: result: no
configure:5799: checking for f77
configure:5829: result: no
configure:5799: checking for frt
configure:5829: result: no
configure:5799: checking for pgf77
configure:5829: result: no
configure:5799: checking for cf77
configure:5829: result: no
configure:5799: checking for fort77
configure:5829: result: no
configure:5799: checking for fl32
configure:5829: result: no
configure:5799: checking for af77
configure:5829: result: no
configure:5799: checking for xlf90
configure:5829: result: no
configure:5799: checking for f90
configure:5829: result: no
configure:5799: checking for pgf90
configure:5829: result: no
configure:5799: checking for pghpf
configure:5829: result: no
configure:5799: checking for epcf90
configure:5829: result: no
configure:5799: checking for gfortran
configure:5815: found /usr/bin/gfortran
configure:5826: result: gfortran
configure:5856: checking for Fortran 77 compiler version
configure:5863: gfortran --version >&5
GNU Fortran 95 (GCC) 4.1.2 20070302 (prerelease) (4.1.2-1mdv2007.1)
Copyright (C) 2006 Free Software Foundation, Inc.

GNU Fortran comes with NO WARRANTY, to the extent permitted by law.
You may redistribute copies of GNU Fortran
under the terms of the GNU General Public License.
For more information about these matters, see the file named COPYING

configure:5866: $? = 0
configure:5873: gfortran -v >&5
Using built-in specs.
Target: x86_64-mandriva-linux-gnu
Configured with: ../configure --prefix=/usr --libexecdir=/usr/lib --with-slibdir=/lib64 --mandir=/usr/share/man --infodir=/usr/share/info --enable-checking=release --enable-languages=c,c++,ada,fortran,objc,obj-c++,java --host=x86_64-mandriva-linux-gnu --with-cpu=generic --with-system-zlib --enable-threads=posix --enable-shared --enable-long-long --enable-__cxa_atexit --disable-libunwind-exceptions --enable-clocale=gnu --enable-java-awt=gtk --with-java-home=/usr/lib/jvm/java-1.4.2-gcj-1.4.2.0/jre --enable-gtk-cairo --disable-libjava-multilib --enable-ssp --disable-libssp
Thread model: posix
gcc version 4.1.2 20070302 (prerelease) (4.1.2-1mdv2007.1)
configure:5876: $? = 0
configure:5883: gfortran -V >&5
gfortran: '-V' option must have argument
configure:5886: $? = 1
configure:5894: checking whether we are using the GNU Fortran 77 compiler
configure:5913: gfortran -c  conftest.F >&5
configure:5919: $? = 0
configure:5936: result: yes
configure:5942: checking whether gfortran accepts -g
configure:5959: gfortran -c -g conftest.f >&5
configure:5965: $? = 0
configure:5981: result: yes
configure:6011: checking the maximum length of command line arguments
configure:6103: result: 32768
configure:6114: checking command to parse /usr/bin/nm -B output from gcc object
configure:6210: gcc -c -g -O2  conftest.c >&5
configure:6213: $? = 0
configure:6217: /usr/bin/nm -B conftest.o \| sed -n -e 's/^.*[ ]\([ABCDGIRSTW][ABCDGIRSTW]*\)[ ][ ]*\([_A-Za-z][_A-Za-z0-9]*\)$/\1 \2 \2/p' \> conftest.nm
configure:6220: $? = 0
configure:6272: gcc -o conftest -g -O2   conftest.c conftstm.o >&5
configure:6275: $? = 0
configure:6313: result: ok
configure:6317: checking for objdir
configure:6332: result: .libs
configure:6424: checking for ar
configure:6440: found /usr/bin/ar
configure:6451: result: ar
configure:6520: checking for ranlib
configure:6536: found /usr/bin/ranlib
configure:6547: result: ranlib
configure:6616: checking for strip
configure:6643: result: strip
configure:6944: checking if gcc static flag  works
configure:6972: result: yes
configure:6994: checking if gcc supports -fno-rtti -fno-exceptions
configure:7012: gcc -c -g -O2  -fno-rtti -fno-exceptions conftest.c >&5
cc1: warning: command line option "-fno-rtti" is valid for C++/ObjC++ but not for C
configure:7016: $? = 0
configure:7029: result: no
configure:7044: checking for gcc option to produce PIC
configure:7248: result: -fPIC
configure:7256: checking if gcc PIC flag -fPIC works
configure:7274: gcc -c -g -O2  -fPIC -DPIC conftest.c >&5
configure:7278: $? = 0
configure:7291: result: yes
configure:7315: checking if gcc supports -c -o file.o
configure:7336: gcc -c -g -O2  -o out/conftest2.o conftest.c >&5
configure:7340: $? = 0
configure:7362: result: yes
configure:7388: checking whether the gcc linker (/usr/bin/ld -m elf_x86_64) supports shared libraries
configure:8280: result: yes
configure:8306: checking whether -lc should be explicitly linked in
configure:8311: gcc -c -g -O2  conftest.c >&5
configure:8314: $? = 0
configure:8328: gcc -shared conftest.o  -v -Wl,-soname -Wl,conftest -o conftest 2\>\&1 \| grep  -lc  \>/dev/null 2\>\&1
configure:8331: $? = 0
configure:8343: result: no
configure:8351: checking dynamic linker characteristics
configure:8905: result: GNU/Linux ld.so
configure:8909: checking how to hardcode library paths into programs
configure:8934: result: immediate
configure:8948: checking whether stripping libraries is possible
configure:8953: result: yes
configure:9750: checking if libtool supports shared libraries
configure:9752: result: yes
configure:9755: checking whether to build shared libraries
configure:9776: result: yes
configure:9779: checking whether to build static libraries
configure:9783: result: yes
configure:9875: creating libtool
configure:10453: checking for ld used by g++
configure:10520: result: /usr/bin/ld -m elf_x86_64
configure:10529: checking if the linker (/usr/bin/ld -m elf_x86_64) is GNU ld
configure:10544: result: yes
configure:10595: checking whether the g++ linker (/usr/bin/ld -m elf_x86_64) supports shared libraries
configure:11471: result: yes
configure:11493: g++ -c -g -O2  conftest.cpp >&5
configure:11496: $? = 0
configure:11606: checking for g++ option to produce PIC
configure:11874: result: -fPIC
configure:11882: checking if g++ PIC flag -fPIC works
configure:11900: g++ -c -g -O2  -fPIC -DPIC conftest.cpp >&5
configure:11904: $? = 0
configure:11917: result: yes
configure:11941: checking if g++ supports -c -o file.o
configure:11962: g++ -c -g -O2  -o out/conftest2.o conftest.cpp >&5
configure:11966: $? = 0
configure:11988: result: yes
configure:12014: checking whether the g++ linker (/usr/bin/ld -m elf_x86_64) supports shared libraries
configure:12039: result: yes
configure:12110: checking dynamic linker characteristics
configure:12664: result: GNU/Linux ld.so
configure:12668: checking how to hardcode library paths into programs
configure:12693: result: immediate
configure:12707: checking whether stripping libraries is possible
configure:12712: result: yes
configure:14015: checking if libtool supports shared libraries
configure:14017: result: yes
configure:14020: checking whether to build shared libraries
configure:14040: result: yes
configure:14043: checking whether to build static libraries
configure:14047: result: yes
configure:14059: checking for gfortran option to produce PIC
configure:14263: result: -fPIC
configure:14271: checking if gfortran PIC flag -fPIC works
configure:14289: gfortran -c -g -O2 -fPIC conftest.f >&5
configure:14293: $? = 0
configure:14306: result: yes
configure:14330: checking if gfortran supports -c -o file.o
configure:14351: gfortran -c -g -O2 -o out/conftest2.o conftest.f >&5
configure:14355: $? = 0
configure:14377: result: yes
configure:14403: checking whether the gfortran linker (/usr/bin/ld -m elf_x86_64) supports shared libraries
configure:15275: result: yes
configure:15346: checking dynamic linker characteristics
configure:15900: result: GNU/Linux ld.so
configure:15904: checking how to hardcode library paths into programs
configure:15929: result: immediate
configure:15943: checking whether stripping libraries is possible
configure:15948: result: yes
configure:21164: checking for main in -lieee
configure:21193: gcc -o conftest -g -O2   conftest.c -lieee   >&5
configure:21199: $? = 0
configure:21217: result: yes
configure:21341: checking for g77
configure:21369: result: no
configure:21390: checking for gfortran
configure:21406: found /usr/bin/gfortran
configure:21418: result: yes
configure:25045: checking for X
configure:25160: gcc -E  conftest.c
configure:25166: $? = 0
configure:25215: gcc -o conftest -O2 -DNDEBUG -Dlinux  -DNARROWPROTO -march=athlon64 -mfpmath=sse -msse2 -m3dnow -m64 -fPIC   -lieee conftest.c -lX11  >&5
configure:25221: $? = 0
configure:25280: result: libraries , headers
configure:25441: gcc -o conftest -O2 -DNDEBUG -Dlinux  -DNARROWPROTO -march=athlon64 -mfpmath=sse -msse2 -m3dnow -m64 -fPIC   -lieee conftest.c   -lX11 >&5
configure:25447: $? = 0
configure:25604: checking for gethostbyname
configure:25660: gcc -o conftest -O2 -DNDEBUG -Dlinux  -DNARROWPROTO -march=athlon64 -mfpmath=sse -msse2 -m3dnow -m64 -fPIC   -lieee conftest.c  >&5
configure:25666: $? = 0
configure:25683: result: yes
configure:25828: checking for connect
configure:25884: gcc -o conftest -O2 -DNDEBUG -Dlinux  -DNARROWPROTO -march=athlon64 -mfpmath=sse -msse2 -m3dnow -m64 -fPIC   -lieee conftest.c  >&5
configure:25890: $? = 0
configure:25907: result: yes
configure:25979: checking for remove
configure:26035: gcc -o conftest -O2 -DNDEBUG -Dlinux  -DNARROWPROTO -march=athlon64 -mfpmath=sse -msse2 -m3dnow -m64 -fPIC   -lieee conftest.c  >&5
configure:26041: $? = 0
configure:26058: result: yes
configure:26130: checking for shmat
configure:26186: gcc -o conftest -O2 -DNDEBUG -Dlinux  -DNARROWPROTO -march=athlon64 -mfpmath=sse -msse2 -m3dnow -m64 -fPIC   -lieee conftest.c  >&5
configure:26192: $? = 0
configure:26209: result: yes
configure:26290: checking for IceConnectionNumber in -lICE
configure:26325: gcc -o conftest -O2 -DNDEBUG -Dlinux  -DNARROWPROTO -march=athlon64 -mfpmath=sse -msse2 -m3dnow -m64 -fPIC   -lieee conftest.c -lICE   >&5
configure:26331: $? = 0
configure:26349: result: yes
configure:26375: checking for X11 release
configure:26402: result: R6
configure:26441: checking for main in -lXmu
configure:26470: gcc -o conftest -O2 -DNDEBUG -Dlinux  -DNARROWPROTO -march=athlon64 -mfpmath=sse -msse2 -m3dnow -m64 -fPIC   -lieee conftest.c -lXmu -lXt -lXext  -lSM -lICE -lX11   >&5
configure:26476: $? = 0
configure:26494: result: yes
configure:26511: checking for main in -lXaw3d
configure:26540: gcc -o conftest -O2 -DNDEBUG -Dlinux  -DNARROWPROTO -march=athlon64 -mfpmath=sse -msse2 -m3dnow -m64 -fPIC   -lieee conftest.c -lXaw3d -lXmu -lXt -lXext  -lSM -lICE -lX11   >&5
/usr/bin/ld: cannot find -lXaw3d
collect2: ld returned 1 exit status
configure:26546: $? = 1
configure: failed program was:
| /* confdefs.h.  */
| #define PACKAGE_NAME ""
| #define PACKAGE_TARNAME ""
| #define PACKAGE_VERSION ""
| #define PACKAGE_STRING ""
| #define PACKAGE_BUGREPORT ""
| #define STDC_HEADERS 1
| #define HAVE_SYS_TYPES_H 1
| #define HAVE_SYS_STAT_H 1
| #define HAVE_STDLIB_H 1
| #define HAVE_STRING_H 1
| #define HAVE_MEMORY_H 1
| #define HAVE_STRINGS_H 1
| #define HAVE_INTTYPES_H 1
| #define HAVE_STDINT_H 1
| #define HAVE_UNISTD_H 1
| #define HAVE_DLFCN_H 1
| #define G95_FORTRAN 1
| /* end confdefs.h.  */
|
|
| int
| main ()
| {
| return main ();
|   ;
|   return 0;
| }
configure:26564: result: no
configure:26665: checking for javac
configure:26681: found /usr/bin/javac
configure:26693: result: yes
configure:26714: checking for javac
configure:26732: found /usr/bin/javac
configure:26745: result: /usr/bin/javac
configure:26761: checking symlink for /usr/bin/javac
configure:26771: result: /usr/java/default/bin/javac
configure:26777: checking for java headers
configure:26830: result:  /usr/java/default/include /usr/java/default/include/linux
configure:26850: checking for leading and/or trailing underscores
configure:26896: result: no yes
configure:26903: checking for use of sharpsign in CPP
configure:26926: gcc -c -O2 -DNDEBUG -Dlinux  -DNARROWPROTO -march=athlon64 -mfpmath=sse -msse2 -m3dnow -m64 -fPIC   conftest.c >&5
configure:26932: $? = 0
configure:26937: result: yes
configure:26958: checking for main in -lm
configure:26987: gcc -o conftest -O2 -DNDEBUG -Dlinux  -DNARROWPROTO -march=athlon64 -mfpmath=sse -msse2 -m3dnow -m64 -fPIC   -lieee conftest.c -lm   >&5
configure:26993: $? = 0
configure:27011: result: yes
configure:27026: checking for exp10
configure:27082: gcc -o conftest -O2 -DNDEBUG -Dlinux  -DNARROWPROTO -march=athlon64 -mfpmath=sse -msse2 -m3dnow -m64 -fPIC   -lieee conftest.c -lm  >&5
conftest.c:46: warning: conflicting types for built-in function 'exp10'
configure:27088: $? = 0
configure:27106: result: yes
configure:27120: checking for getwd
configure:27176: gcc -o conftest -O2 -DNDEBUG -Dlinux  -DNARROWPROTO -march=athlon64 -mfpmath=sse -msse2 -m3dnow -m64 -fPIC   -lieee conftest.c -lm  >&5
/root/tmp/ccsng1iY.o: In function `main':
conftest.c:(.text+0x7): warning: the `getwd' function is dangerous and should not be used.
configure:27182: $? = 0
configure:27200: result: yes
configure:27214: checking for sleep
configure:27270: gcc -o conftest -O2 -DNDEBUG -Dlinux  -DNARROWPROTO -march=athlon64 -mfpmath=sse -msse2 -m3dnow -m64 -fPIC   -lieee conftest.c -lm  >&5
configure:27276: $? = 0
configure:27294: result: yes
configure:27308: checking for strerror
configure:27364: gcc -o conftest -O2 -DNDEBUG -Dlinux  -DNARROWPROTO -march=athlon64 -mfpmath=sse -msse2 -m3dnow -m64 -fPIC   -lieee conftest.c -lm  >&5
configure:27370: $? = 0
configure:27388: result: yes
configure:27402: checking for usleep
configure:27458: gcc -o conftest -O2 -DNDEBUG -Dlinux  -DNARROWPROTO -march=athlon64 -mfpmath=sse -msse2 -m3dnow -m64 -fPIC   -lieee conftest.c -lm  >&5
configure:27464: $? = 0
configure:27482: result: yes
configure:27496: checking for finite
configure:27552: gcc -o conftest -O2 -DNDEBUG -Dlinux  -DNARROWPROTO -march=athlon64 -mfpmath=sse -msse2 -m3dnow -m64 -fPIC   -lieee conftest.c -lm  >&5
conftest.c:51: warning: conflicting types for built-in function 'finite'
configure:27558: $? = 0
configure:27576: result: yes
configure:27607: checking limits.h usability
configure:27624: gcc -c -O2 -DNDEBUG -Dlinux  -DNARROWPROTO -march=athlon64 -mfpmath=sse -msse2 -m3dnow -m64 -fPIC   conftest.c >&5
configure:27630: $? = 0
configure:27644: result: yes
configure:27648: checking limits.h presence
configure:27663: gcc -E  conftest.c
configure:27669: $? = 0
configure:27683: result: yes
configure:27711: checking for limits.h
configure:27719: result: yes
configure:27607: checking values.h usability
configure:27624: gcc -c -O2 -DNDEBUG -Dlinux  -DNARROWPROTO -march=athlon64 -mfpmath=sse -msse2 -m3dnow -m64 -fPIC   conftest.c >&5
configure:27630: $? = 0
configure:27644: result: yes
configure:27648: checking values.h presence
configure:27663: gcc -E  conftest.c
configure:27669: $? = 0
configure:27683: result: yes
configure:27711: checking for values.h
configure:27719: result: yes
configure:27738: checking for main in -lncurses
configure:27767: gcc -o conftest -O2 -DNDEBUG -Dlinux  -DNARROWPROTO -march=athlon64 -mfpmath=sse -msse2 -m3dnow -m64 -fPIC   -lieee conftest.c -lncurses  -lm  >&5
configure:27773: $? = 0
configure:27791: result: yes
configure:28043: checking for PVM architecture
configure:28052: result: UNKNOWN
configure:28056: WARNING: PVM unable to find architecture: I will not use PVM
configure:28163: checking for main in -ldl
configure:28192: gcc -o conftest -O2 -DNDEBUG -Dlinux  -DNARROWPROTO -march=athlon64 -mfpmath=sse -msse2 -m3dnow -m64 -fPIC   -lieee conftest.c -ldl  -lm  >&5
configure:28198: $? = 0
configure:28216: result: yes
configure:28228: checking for header file tcl.h
configure:28233: result: found in /usr/include
configure:28246: checking if tcl is version 8.4 or later
configure:28308: gcc -o conftest -O2 -DNDEBUG -Dlinux  -DNARROWPROTO -march=athlon64 -mfpmath=sse -msse2 -m3dnow -m64 -fPIC  -I/usr/include  -I/usr/include -lieee conftest.c -lm  >&5
configure:28311: $? = 0
configure:28317: ./conftest
configure:28320: $? = 0
configure:28357: result: (8.4) yes
configure:28382: checking for tcl library tcl8.4
configure:28233: result: found in ../../include
configure:28246: checking if tcl is version 8.4 or later
configure:28308: gcc -o conftest -O2 -DNDEBUG -Dlinux  -DNARROWPROTO -march=athlon64 -mfpmath=sse -msse2 -m3dnow -m64 -fPIC  -I../../include  -I../../include -lieee conftest.c -lm  >&5
configure:28311: $? = 0
configure:28317: ./conftest
configure:28320: $? = 0
configure:28357: result: (8.4) yes
configure:28382: checking for tcl library tcl8.4
configure:28580: error: header file tcl.h has been found for 8.4*  but no corresponding tcl library (ie libtcl8.4.so)

## ---------------- ##
## Cache variables. ##
## ---------------- ##

ac_cv_PVM_arch=UNKNOWN
ac_cv_X11_release=R6
ac_cv_build=x86_64-unknown-linux-gnu
ac_cv_c_compiler_gnu=yes
ac_cv_cxx_compiler_gnu=yes
ac_cv_env_CCC_set=
ac_cv_env_CCC_value=
ac_cv_env_CC_set=
ac_cv_env_CC_value=
ac_cv_env_CFLAGS_set=
ac_cv_env_CFLAGS_value=
ac_cv_env_CPPFLAGS_set=
ac_cv_env_CPPFLAGS_value=
ac_cv_env_CPP_set=
ac_cv_env_CPP_value=
ac_cv_env_CXXCPP_set=
ac_cv_env_CXXCPP_value=
ac_cv_env_CXXFLAGS_set=
ac_cv_env_CXXFLAGS_value=
ac_cv_env_CXX_set=
ac_cv_env_CXX_value=
ac_cv_env_F77_set=
ac_cv_env_F77_value=
ac_cv_env_FFLAGS_set=
ac_cv_env_FFLAGS_value=
ac_cv_env_LDFLAGS_set=
ac_cv_env_LDFLAGS_value=
ac_cv_env_LIBS_set=
ac_cv_env_LIBS_value=
ac_cv_env_XMKMF_set=
ac_cv_env_XMKMF_value=
ac_cv_env_build_alias_set=
ac_cv_env_build_alias_value=
ac_cv_env_host_alias_set=
ac_cv_env_host_alias_value=
ac_cv_env_target_alias_set=
ac_cv_env_target_alias_value=
ac_cv_f77_compiler_gnu=yes
ac_cv_func_connect=yes
ac_cv_func_exp10=yes
ac_cv_func_finite=yes
ac_cv_func_gethostbyname=yes
ac_cv_func_getwd=yes
ac_cv_func_remove=yes
ac_cv_func_shmat=yes
ac_cv_func_sleep=yes
ac_cv_func_strerror=yes
ac_cv_func_usleep=yes
ac_cv_have_x='have_x=yes ac_x_includes='\'''\'' ac_x_libraries='\'''\'''
ac_cv_header_dlfcn_h=yes
ac_cv_header_inttypes_h=yes
ac_cv_header_limits_h=yes
ac_cv_header_memory_h=yes
ac_cv_header_stdc=yes
ac_cv_header_stdint_h=yes
ac_cv_header_stdlib_h=yes
ac_cv_header_string_h=yes
ac_cv_header_strings_h=yes
ac_cv_header_sys_stat_h=yes
ac_cv_header_sys_types_h=yes
ac_cv_header_unistd_h=yes
ac_cv_header_values_h=yes
ac_cv_host=x86_64-unknown-linux-gnu
ac_cv_lib_ICE_IceConnectionNumber=yes
ac_cv_lib_Xaw3d_main=no
ac_cv_lib_Xmu_main=yes
ac_cv_lib_dl_main=yes
ac_cv_lib_ieee_main=yes
ac_cv_lib_m_main=yes
ac_cv_lib_ncurses_main=yes
ac_cv_objext=o
ac_cv_path_EGREP='/bin/grep -E'
ac_cv_path_GREP=/bin/grep
ac_cv_path__ACJNI_JAVAC=/usr/bin/javac
ac_cv_prog_CPP='gcc -E'
ac_cv_prog_CXXCPP='g++ -E'
ac_cv_prog_WITH_G77=no
ac_cv_prog_WITH_GFORTRAN=yes
ac_cv_prog_WITH_JAVAC=yes
ac_cv_prog_ac_ct_AR=ar
ac_cv_prog_ac_ct_CC=gcc
ac_cv_prog_ac_ct_CXX=g++
ac_cv_prog_ac_ct_F77=gfortran
ac_cv_prog_ac_ct_RANLIB=ranlib
ac_cv_prog_ac_ct_STRIP=strip
ac_cv_prog_cc_c89=
ac_cv_prog_cc_g=yes
ac_cv_prog_cxx_g=yes
ac_cv_prog_f77_g=yes
lt_cv_deplibs_check_method=pass_all
lt_cv_file_magic_cmd='$MAGIC_CMD'
lt_cv_file_magic_test_file=
lt_cv_ld_reload_flag=-r
lt_cv_objdir=.libs
lt_cv_path_LD=/usr/bin/ld
lt_cv_path_LDCXX='/usr/bin/ld -m elf_x86_64'
lt_cv_path_NM='/usr/bin/nm -B'
lt_cv_path_SED=/bin/sed
lt_cv_prog_compiler_c_o=yes
lt_cv_prog_compiler_c_o_CXX=yes
lt_cv_prog_compiler_c_o_F77=yes
lt_cv_prog_compiler_rtti_exceptions=no
lt_cv_prog_gnu_ld=yes
lt_cv_prog_gnu_ldcxx=yes
lt_cv_sys_global_symbol_pipe='sed -n -e '\''s/^.*[ ]\([ABCDGIRSTW][ABCDGIRSTW]*\)[ ][ ]*\([_A-Za-z][_A-Za-z0-9]*\)$/\1 \2 \2/p'\'''
lt_cv_sys_global_symbol_to_c_name_address='sed -n -e '\''s/^: \([^ ]*\) $/  {\"\1\", (lt_ptr) 0},/p'\'' -e '\''s/^[BCDEGRST] \([^ ]*\) \([^ ]*\)$/  {"\2", (lt_ptr) \&\2},/p'\'''
lt_cv_sys_global_symbol_to_cdecl='sed -n -e '\''s/^. .* \(.*\)$/extern int \1;/p'\'''
lt_cv_sys_max_cmd_len=32768
lt_lt_cv_prog_compiler_c_o='"yes"'
lt_lt_cv_prog_compiler_c_o_CXX='"yes"'
lt_lt_cv_prog_compiler_c_o_F77='"yes"'
lt_lt_cv_sys_global_symbol_pipe='"sed -n -e '\''s/^.*[ ]\\([ABCDGIRSTW][ABCDGIRSTW]*\\)[ ][ ]*\\([_A-Za-z][_A-Za-z0-9]*\\)\$/\\1 \\2 \\2/p'\''"'
lt_lt_cv_sys_global_symbol_to_c_name_address='"sed -n -e '\''s/^: \\([^ ]*\\) \$/  {\\\"\\1\\\", (lt_ptr) 0},/p'\'' -e '\''s/^[BCDEGRST] \\([^ ]*\\) \\([^ ]*\\)\$/  {\"\\2\", (lt_ptr) \\&\\2},/p'\''"'
lt_lt_cv_sys_global_symbol_to_cdecl='"sed -n -e '\''s/^. .* \\(.*\\)\$/extern int \\1;/p'\''"'

## ----------------- ##
## Output variables. ##
## ----------------- ##

AR='ar'
AR_FLAGS='cru'
ATLAS_DIR=''
BLPR_SCRIPTS='$(BPROGRAMS)'
CC='gcc'
CC_LDFLAGS='-lieee'
CC_OPTIONS='-O2 -DNDEBUG -Dlinux  -DNARROWPROTO -march=athlon64 -mfpmath=sse -msse2 -m3dnow -m64 -fPIC '
CC_PICFLAGS='-fPIC'
CFLAGS='-O2 -DNDEBUG -Dlinux  -DNARROWPROTO -march=athlon64 -mfpmath=sse -msse2 -m3dnow -m64 -fPIC '
CPP='gcc -E'
CPPFLAGS=''
CXX='g++'
CXXCPP='g++ -E'
CXXFLAGS='-g -O2'
DEFS=''
DLDLIB=''
DLD_SUBDIR=''
DLLTOOL='dlltool'
ECHO='echo'
ECHO_C=''
ECHO_N='-n'
ECHO_T=''
EGREP='/bin/grep -E'
EXAMPLES_TESTS='$(SUBDIRS1) $(SUBDIRS2)'
EXEEXT=''
F2C=''
F2C_SUBDIR=''
F77='gfortran'
FC='gfortran'
FC_LDFLAGS='-lieee -ldl -rdynamic -Wl,-relax '
FC_OPTIONS1='-ff2c -march=athlon64 -mfpmath=sse -msse2 -m3dnow -m64 -fPIC'
FC_OPTIONS2='-O -ff2c -march=athlon64 -mfpmath=sse -msse2 -m3dnow -m64 -fPIC'
FC_OPTIONS='-O -ff2c -march=athlon64 -mfpmath=sse -msse2 -m3dnow -m64 -fPIC'
FC_PICFLAGS='-fPIC'
FC_SUBDIR=''
FFLAGS='-g -O2'
FGETARG='fgetarg'
FILES_TO_CLEAN='*.CKP *.ln *.BAK *.bak core errs ,* *~ *.a .emacs_* tags TAGS make.log MakeOut .*~ *.trace so_locations *.orig *.cos *.obj'
FLIBS=''
GCCFIX=''
GETARG='getarg'
GETLIBTK=''
GNOMECFLAGS=''
GNOME_CONFIG=''
GREP='/bin/grep'
GTKCFLAGS=''
GTKLIBS=''
GTKPLUGBUG=''
GTK_CONFIG=''
GUILIB='xsci'
GZVT=''
HPPA_OLD=''
HTMLFLAGS=''
ICC=''
IFC=''
IMPENV=''
IMPPREF='S'
IN_ATLAS=''
JAVASCITARGET='scilex-lib'
JAVASCITARGET_DISTCLEAN='distclean'
JAVA_INCL=' -I/usr/java/default/include -I/usr/java/default/include/linux'
LD='ld'
LDFLAGS='-lieee'
LD_LDFLAGS='-lieee -Wl,-relax '
LIBM=''
LIBOBJS=''
LIBS='-lm '
LIBTOOL='$(SHELL) $(top_builddir)/libtool'
LIBTOOL_DEPS='config/ltmain.sh'
LN_S='ln -s'
LTLIBOBJS=''
MAIN='mainsci.o'
MAKEFILE_TARGET='Makefile.linux64'
MALLOC='malloc.o'
MANGENERATOR=''
MANTARGET=''
MENUSOBJS='XOBJS'
NM='/usr/bin/nm -B'
NOINLINE=''
OBJDUMP='objdump'
OBJEXT='o'
OCAMLTARGET=''
OCAMLTARGET_DISTCLEAN=''
PACKAGE=''
PACKAGE_BUGREPORT=''
PACKAGE_NAME=''
PACKAGE_STRING=''
PACKAGE_TARNAME=''
PACKAGE_VERSION=''
PATH_SEPARATOR=':'
PERIFILE='periX11.o'
PERIX11NOPT='periX11darwin'
PKG_CONFIG=''
PVMARCH=''
PVMGLIB=''
PVMHELP='pvm'
PVMHOSTER=''
PVMHOSTERFILES=''
PVMINCLUDE='/usr/local/scilab-4.1.2/pvm3/include'
PVMINST1='$(INSTPVMBINDISTFILES)'
PVMINST='$(PVMBINDISTFILES)'
PVMLIB=''
PVMROOT='/usr/local/scilab-4.1.2/pvm3'
PVMROOTR='$SCI/pvm3'
PVMSCIDIR=''
PVMSCILIB=''
PVMTARGET='pvm_disabled'
PVMTARGET_DISTCLEAN='pvm_disabled'
RANLIB='ranlib'
RM='rm -f'
SCIDCOPY='scidcopy'
SCILABSCRIPT='scilab.g'
SCILAB_GS='sh'
SCIVERSION='scilab-4.1.2'
SED_CYGDRIVE=''
SHELL='/bin/sh'
SONAME='so'
STATIC=''
STRIP='strip'
TCLSCIDIR=''
TCLSCILIB=''
TCLTKHELP='tksci'
TCLTK_LIBS=' -ldl'
TCL_INC_PATH='-I../../include'
TERMCAPLIB='-lncurses'
TERM_LDFLAGS=''
TERM_NAME=''
TKBASE=''
TK_INC_PATH=''
TK_MAJOR_VERSION=''
TK_MINOR_VERSION=''
UNSFDCOPY='unsfdcopy'
WHICH_BLAS=''
WINXFLAGS=''
WITH_F95=''
WITH_G77='no'
WITH_GCC=''
WITH_GFORTRAN='yes'
WITH_JAVAC='yes'
WITH_OCAML=''
WITH_SABCMD=''
WITH_XSLTPROC=''
XAW='Xaw3d'
XAWLIB='$(SCIDIR)/libs/libXaw3d.a'
XAW_LOCAL_INCLUDES='-I$(SCIDIR)/routines'
XAW_LOCAL_LIB='$(SCIDIR)/libs/libXaw3d.a $(SCIDIR)/libs/libXmu.a'
XAW_LOCAL_SUBDIR='X11'
XDRLIB=''
XDRLIBNAME=''
XMKMF=''
XMULIB='$(SCIDIR)/libs/libXmu.a'
XX11='-lX11'
XXTXEXT='-lXt -lXext'
X_CFLAGS=''
X_EXTRA_LIBS=''
X_LIBS=''
X_PRE_LIBS=' -lSM -lICE'
ZZLEDT=''
_ACJNI_JAVAC='/usr/bin/javac'
ac_ct_CC='gcc'
ac_ct_CXX='g++'
ac_ct_F77='gfortran'
bindir='${exec_prefix}/bin'
build='x86_64-unknown-linux-gnu'
build_alias=''
build_cpu='x86_64'
build_os='linux-gnu'
build_vendor='unknown'
datadir='${datarootdir}'
datarootdir='${prefix}/share'
docdir='${datarootdir}/doc/${PACKAGE}'
dvidir='${docdir}'
exec_prefix='NONE'
host='x86_64-unknown-linux-gnu'
host_alias=''
host_cpu='x86_64'
host_os='linux-gnu'
host_vendor='unknown'
htmldir='${docdir}'
includedir='${prefix}/include'
infodir='${datarootdir}/info'
libdir='${exec_prefix}/lib'
libexecdir='${exec_prefix}/libexec'
localedir='${datarootdir}/locale'
localstatedir='${prefix}/var'
mandir='${datarootdir}/man'
oldincludedir='/usr/include'
pdfdir='${docdir}'
prefix='NONE'
program_transform_name='s,x,x,'
psdir='${docdir}'
sbindir='${exec_prefix}/sbin'
sharedstatedir='${prefix}/com'
sysconfdir='${prefix}/etc'
target_alias=''
with_ocamlc=''
with_ocamldep=''
with_ocamlopt=''

## ----------- ##
## confdefs.h. ##
## ----------- ##

#define PACKAGE_NAME ""
#define PACKAGE_TARNAME ""
#define PACKAGE_VERSION ""
#define PACKAGE_STRING ""
#define PACKAGE_BUGREPORT ""
#define STDC_HEADERS 1
#define HAVE_SYS_TYPES_H 1
#define HAVE_SYS_STAT_H 1
#define HAVE_STDLIB_H 1
#define HAVE_STRING_H 1
#define HAVE_MEMORY_H 1
#define HAVE_STRINGS_H 1
#define HAVE_INTTYPES_H 1
#define HAVE_STDINT_H 1
#define HAVE_UNISTD_H 1
#define HAVE_DLFCN_H 1
#define G95_FORTRAN 1
#define WTU 1
#define USE_SHARP_SIGN 1
#define HAVE_LIBM 1
#define HAVE_EXP10 1
#define HAVE_GETWD 1
#define HAVE_SLEEP 1
#define HAVE_STRERROR 1
#define HAVE_USLEEP 1
#define HAVE_FINITE 1
#define HAVE_LIMITS_H 1
#define HAVE_VALUES_H 1
#define HAVE_TERMCAP 1

configure: exit 1
Sylvestre Ledru Sylvestre Ledru
Reply | Threaded
Open this post in threaded view
|

Re: installation troubleshoot on Linux x86_64

Hello,


In your config.log, you can find the line:
> configure:28580: error: header file tcl.h has been found for 8.4*  but
> no corresponding tcl library (ie libtcl8.4.so)
Which means that you have a problem of your TCL/TK installation.
Try to fix it and the ./configure should work.

Sylvestre


signature.asc (189 bytes) Download Attachment